{"text_format":"1","workbook":"xlsx","n_sheets":5,"sheets":["PPF Calculator","Goal Calculator","PPF Matuirty date Calculation","PPF Tracker","Post 15 yearsTracker "],"not_rendered":{"charts":0,"images":0,"macros":1,"external_links":0,"defined_names":12,"comments":1,"pivot_tables":0},"unopened":[],"bounds":{"document_bytes":16777216,"sheet_cells":100000,"rows_first":2000,"rows_last":500,"rows_between":2000,"halvings":0,"cell_chars":16384,"cell_head_chars":4096},"cells_cut":0,"cells_raw":0,"read":"whole","date_system":"1900"}

{"sheet":"PPF Calculator","index":0,"n_rows":250,"n_cols":25,"rows_kept":250,"cut":false,"hidden":false,"merged":[[235,7,235,10],[107,7,107,10],[123,7,123,10],[139,7,139,10],[155,7,155,10],[171,7,171,10],[187,7,187,10],[12,4,14,5],[203,7,203,10],[219,7,219,10],[91,7,91,10],[11,7,11,10],[27,7,27,10],[59,7,59,10],[43,7,43,10],[75,7,75,10],[1,3,2,14],[7,12,7,13],[7,4,7,5],[7,7,7,10],[8,7,8,9]]}
[null,null,null,null,null,null,null,null,null,null,null,null,null,null,null,null,null,null,null,null,null,null,null,null,30000]
[null,null,null,"PPF Calculator"]
[]
[null,null,null,null,null,null,null,"Prepared by: Karthikeyan Chellappa"]
[]
[]
[]
[null,null,null,null,"Input Parameters",null,null,"Calculations",null,null,null,null,"Output Values"]
[null,null,null,null,"Investment Frequency","Monthly",null,"PPF Interest Rate",null,null,8.6999999999999994E-2,null,"Maturity Amount",{"$f":"J250","v":29999.999999999236}]
[null,null,null,null,"Investment Amount",83.252217930602711]
[]
[null,null,null,null,null,null,null,"Year 1"]
[null,null,null,null,{"$f":"IF(AND(F9=\"Monthly\",F10*12>=150000),\"Warning: Annual Investment should not exceed 1.5 lakh\",IF(AND(F9=\"Quarterly\",F10*4>150000),\"Warning: Annual Investment should not exceed 1.5 lakh\",IF(AND(F9=\"Half-Yearly\",F10*2>150000),\"Warning: Annual Investment should not exceed 1.5 lakh\",IF(AND(F9=\"Annual\",F10>150000),\"Warning: Annual Investment should not exceed 1.5 lakh\",\"\"))))","v":""},null,null,"Month","Deposit","Balance","Interest"]
[null,null,null,null,null,null,null,"Apr",{"$f":"$F$10","v":83.252217930602711},{"$f":"I14","v":83.252217930602711},{"$f":"J14*$K$9/12","v":0.60357857999686959}]
[null,null,null,null,null,null,null,"May",{"$f":"IF($F$9=\"Monthly\",$F$10,0)","v":83.252217930602711},{"$f":"I15+J14","v":166.50443586120542},1.2071571599937392]
[null,null,null,null,null,null,null,"Jun",{"$f":"IF($F$9=\"Monthly\",$F$10,0)","v":83.252217930602711},{"$f":"I16+J15","v":249.75665379180813},1.8107357399906088]
[null,null,null,null,null,null,null,"Jul",{"$f":"IF(OR($F$9=\"Monthly\",$F$9=\"Quarterly\"),$F$10,0)","v":83.252217930602711},333.00887172241084,2.4143143199874784]
[null,null,null,null,null,null,null,"Aug",{"$f":"IF($F$9=\"Monthly\",$F$10,0)","v":83.252217930602711},416.26108965301353,3.0178928999843477]
[null,null,null,null,null,null,null,"Sep",{"$f":"IF($F$9=\"Monthly\",$F$10,0)","v":83.252217930602711},499.51330758361621,3.6214714799812171]
[null,null,null,null,null,null,null,"Oct",{"$f":"IF($F$9<>\"Annual\",$F$10,0)","v":83.252217930602711},582.76552551421889,4.2250500599780869]
[null,null,null,null,null,null,null,"Nov",{"$f":"IF($F$9=\"Monthly\",$F$10,0)","v":83.252217930602711},666.01774344482158,4.8286286399749558]
[null,null,null,null,null,null,null,"Dec",{"$f":"IF($F$9=\"Monthly\",$F$10,0)","v":83.252217930602711},749.26996137542426,5.4322072199718257]
[null,null,null,null,null,null,null,"Jan",{"$f":"IF(OR($F$9=\"Monthly\",$F$9=\"Quarterly\"),$F$10,0)","v":83.252217930602711},832.52217930602694,6.0357857999686955]
[null,null,null,null,null,null,null,"Feb",{"$f":"IF($F$9=\"Monthly\",$F$10,0)","v":83.252217930602711},915.77439723662962,6.6393643799655644]
[null,null,null,null,null,null,null,"Mar",{"$f":"IF($F$9=\"Monthly\",$F$10,0)","v":83.252217930602711},999.02661516723231,7.2429429599624342]
[null,null,null,null,null,null,null,"Year End Balance",null,{"$f":"J25+SUM(K14:K25)","v":1046.1057444069882}]
[]
[null,null,null,null,null,null,null,"Year 2"]
[null,null,null,null,null,null,null,"Month","Deposit","Balance","Interest"]
[null,null,null,null,null,null,null,"Apr",{"$f":"$F$10","v":83.252217930602711},{"$f":"I30+J26","v":1129.3579623375908},{"$f":"J30*$K$9/12","v":8.1878452269475321}]
[null,null,null,null,null,null,null,"May",{"$f":"IF($F$9=\"Monthly\",$F$10,0)","v":83.252217930602711},{"$f":"I31+J30","v":1212.6101802681935},8.7914238069444028]
[null,null,null,null,null,null,null,"Jun",{"$f":"IF($F$9=\"Monthly\",$F$10,0)","v":83.252217930602711},{"$f":"I32+J31","v":1295.8623981987962},9.3950023869412718]
[null,null,null,null,null,null,null,"Jul",{"$f":"IF(OR($F$9=\"Monthly\",$F$9=\"Quarterly\"),$F$10,0)","v":83.252217930602711},1379.1146161293989,9.9985809669381407]
[null,null,null,null,null,null,null,"Aug",{"$f":"IF($F$9=\"Monthly\",$F$10,0)","v":83.252217930602711},1462.3668340600016,10.602159546935011]
[null,null,null,null,null,null,null,"Sep",{"$f":"IF($F$9=\"Monthly\",$F$10,0)","v":83.252217930602711},1545.6190519906042,11.205738126931879]
[null,null,null,null,null,null,null,"Oct",{"$f":"IF($F$9<>\"Annual\",$F$10,0)","v":83.252217930602711},1628.8712699212069,11.809316706928749]
[null,null,null,null,null,null,null,"Nov",{"$f":"IF($F$9=\"Monthly\",$F$10,0)","v":83.252217930602711},1712.1234878518096,12.412895286925618]
[null,null,null,null,null,null,null,"Dec",{"$f":"IF($F$9=\"Monthly\",$F$10,0)","v":83.252217930602711},1795.3757057824123,13.016473866922489]
[null,null,null,null,null,null,null,"Jan",{"$f":"IF(OR($F$9=\"Monthly\",$F$9=\"Quarterly\"),$F$10,0)","v":83.252217930602711},1878.627923713015,13.620052446919358]
[null,null,null,null,null,null,null,"Feb",{"$f":"IF($F$9=\"Monthly\",$F$10,0)","v":83.252217930602711},1961.8801416436177,14.223631026916228]
{"$rows_left_out":211}
{"sheet":"Goal Calculator","index":1,"n_rows":12,"n_cols":15,"rows_kept":12,"cut":false,"hidden":false,"merged":[]}
["Goal Calculator",null,null,null,null,null,null,null,null,null,null,{"$f":"'PPF Calculator'!F9","v":"Monthly"},null,"Monthly",12]
["Determine the fixed investment need to obtain a certain  maturity value",null,null,null,null,null,null,null,null,null,null,{"$f":"INDEX(N1:O4,MATCH(L1,N1:N4,0),2)","v":12},null,"Quarterly",4]
[null,null,null,null,null,null,null,null,null,null,null,null,null,"Half-yearly",2]
["Step 1 ","Enter maturity value required",null,null,30000,"Enter current investment limit",null,null,150000,null,null,null,null,"Annual",1]
[]
["Step 2","Go to PPF Calculator sheet. Select investment frequency and the interest rate"]
[]
["Step 3"]
[]
[]
["Fixed investment amount for the selected is",null,null,null,null,83.252217930602711]
[{"$f":"IF(F11*L2>I4, \"Answer is above investment limit. Choose lower maturity value and repeat step 3\",\"\")","v":""}]

{"sheet":"PPF Matuirty date Calculation","index":2,"n_rows":26,"n_cols":11,"rows_kept":26,"cut":false,"hidden":false,"merged":[[8,9,17,9],[5,10,8,10],[19,3,19,8],[20,9,25,9]]}
[]
[null,null,null,null,null,"Year","Financial Year"]
["Date when account was opened","2015-04-01",null,"2016-03-31",{"$f":"IF(MONTH(B3)<=3,YEAR(B3),YEAR(B3)+1)","v":2016},0,{"$f":"CONCATENATE(\"FY \",H3,\" - \",I3)","v":"FY 2015 - 2016"},{"$f":"IF(MONTH(B3)<=3,YEAR(B3)-1,YEAR(B3))","v":2015},{"$f":"H3+1","v":2016}]
[null,null,null,"2016-03-31",{"$f":"E3+1","v":2017},{"$f":"F3+1","v":1},{"$f":"CONCATENATE(\"FY \",H4,\" - \",I4)","v":"FY 2016 - 2017"},{"$f":"H3+1","v":2016},{"$f":"I3+1","v":2017}]
["Date of maturity",{"$f":"DATE(E18,4,1)","v":"2031-04-01"},null,"2016-03-31",2018,2,"FY 2017 - 2018",2017,2018]
["If you wish to extend it has to be done before",null,null,"2016-03-31",2019,3,"FY 2018 - 2019",2018,2019,null,"Loan eligibility"]
[null,{"$f":"DATE(YEAR(B5),3,31)","v":"2031-03-31"},null,"2016-03-31",2020,4,"FY 2019 - 2020",2019,2020]
[null,null,null,"2016-03-31",2021,5,"FY 2020 - 2021",2020,2021]
["Date when account was extended",{"$f":"B5","v":"2031-04-01"},null,"2016-03-31",2022,6,"FY 2021 - 2022",2021,2022,"Withdrawl possible"]
[null,null,null,"2016-03-31",2023,7,"FY 2022 - 2023",2022,2023]
["Date of maturity",{"$f":"DATE(E26,4,1)","v":"2036-04-01"},null,"2016-03-31",2024,8,"FY 2023 - 2024",2023,2024]
[null,null,null,"2016-03-31",2025,9,"FY 2024 - 2025",2024,2025]
[null,null,null,"2016-03-31",2026,10,"FY 2025 - 2026",2025,2026]
[null,null,null,"2016-03-31",2027,11,"FY 2026 - 2027",2026,2027]
[null,null,null,"2016-03-31",2028,12,"FY 2027 - 2028",2027,2028]
[null,null,null,"2016-03-31",2029,13,"FY 2028 - 2029",2028,2029]
[null,null,null,"2016-03-31",2030,14,"FY 2029 - 2030",2029,2030]
[null,null,null,"2016-03-31",2031,15,"FY 2030 - 2031",2030,2031]
[]
[null,null,null,"For Extension only"]
[null,null,null,null,null,"Year","Financial Year",null,null,"Withdrawl possible = 60% of last FY balance"]
[null,null,null,"2016-03-31",{"$f":"YEAR(B9)+1","v":2032},1,{"$f":"CONCATENATE(\"FY \",H22,\" - \",I22)","v":"FY 2031 - 2032"},{"$f":"YEAR(B9)","v":2031},{"$f":"H22+1","v":2032}]
[null,null,null,"2016-03-31",{"$f":"E22+1","v":2033},2,{"$f":"CONCATENATE(\"FY \",H23,\" - \",I23)","v":"FY 2032 - 2033"},{"$f":"H22+1","v":2032},2033]
[null,null,null,"2016-03-31",2034,3,{"$f":"CONCATENATE(\"FY \",H24,\" - \",I24)","v":"FY 2033 - 2034"},2033,2034]
[null,null,null,"2016-03-31",2035,4,{"$f":"CONCATENATE(\"FY \",H25,\" - \",I25)","v":"FY 2034 - 2035"},2034,2035]
[null,null,null,"2016-03-31",2036,5,{"$f":"CONCATENATE(\"FY \",H26,\" - \",I26)","v":"FY 2035 - 2036"},2035,2036]

{"sheet":"PPF Tracker","index":3,"n_rows":330,"n_cols":30,"rows_kept":330,"cut":false,"hidden":false,"merged":[[203,9,203,12],[219,9,219,12],[235,9,235,12],[107,9,107,12],[123,9,123,12],[139,9,139,12],[155,9,155,12],[171,9,171,12],[187,9,187,12],[170,4,170,18],[186,4,186,18],[202,4,202,18],[218,4,218,18],[234,4,234,18],[154,4,154,18],[138,4,138,18],[43,9,43,12],[59,9,59,12],[75,9,75,12],[5,9,5,11],[42,4,42,18],[26,4,26,18],[10,4,10,18],[1,3,2,18],[7,4,7,5],[7,16,7,17],[11,9,11,12],[27,9,27,12],[122,4,122,18],[106,4,106,18],[90,4,90,18],[74,4,74,18],[58,4,58,18],[91,9,91,12],[250,4,250,18],[251,9,251,12],[266,4,266,18],[267,9,267,12],[282,4,282,18],[283,9,283,12],[298,4,298,18],[299,9,299,12],[314,4,314,18],[315,9,315,12]]}
[null,null,null,null,null,null,null,null,null,null,null,null,null,null,null,null,null,null,null,null,null,null,null,null,null,null,null,null,null,"before 5th"]
[null,null,null,"PPF Tracker",null,null,null,null,null,null,null,null,null,null,null,null,null,null,null,null,null,null,null,null,null,null,null,null,null,"after 5th"]
[]
[]
[null,null,null,null,"Enter data only in green cells",null,null,null,null,"Account opening date ",null,null,{"$f":"'PPF Matuirty date Calculation'!B3","v":"2015-04-01"},null,"This has to be entered in \"PPF Matuirty date Calculation\" sheet"]
[null,null,null,null,null,null,null,null,null,"Maturity Date",null,null,{"$f":"'PPF Matuirty date Calculation'!B5","v":"2031-04-01"}]
[]
[null,null,null,null,null,null,null,null,null,"Balance on March 31st of",null,null,2016]
[null,null,null,null,null,null,null,null,null,"Set as zero for new accounts",null,null,121212]
[]
[null,null,null,null,{"$f":"IF(DATE(MID(J12,4,4),4,1)>=$M$6,\"Account has matured. No further deposits are possible unless extended for 5Y years. Account can be kept alive without deposits\",\"\")","v":""}]
[null,null,null,{"$f":"IF(ISERROR(INDEX('PPF Matuirty date Calculation'!$F$3:$G$18,MATCH('PPF Tracker'!J12,'PPF Matuirty date Calculation'!$G$3:$G$18,0),1)),D10+1,INDEX('PPF Matuirty date Calculation'!$F$3:$G$18,MATCH('PPF Tracker'!J12,'PPF Matuirty date Calculation'!$G$3:$G$18,0),1))","v":1},null,null,null,null,1,{"$f":"CONCATENATE(\"FY \",$M$8+I12-1,\" - \",$M$8+I12)","v":"FY 2016 - 2017"},null,null,null,null,{"$f":"IF(ISERROR(CONCATENATE(INDEX('PPF Matuirty date Calculation'!$F$3:$G$18,MATCH('PPF Tracker'!J12,'PPF Matuirty date Calculation'!$G$3:$G$18,0),1),\"th financial year\")),CONCATENATE(D12,\"th financial year\"),CONCATENATE(INDEX('PPF Matuirty date Calculation'!$F$3:$G$18,MATCH('PPF Tracker'!J12,'PPF Matuirty date Calculation'!$G$3:$G$18,0),1),\"th financial year\"))","v":"1th financial year"}]
[null,null,null,null,{"$f":"IF(ISERROR(IF(AND(D12>=3,D12<=6),\"Loan amount available\",\"\")),\"\",IF(AND(D12>=3,D12<=6),\"Loan amount available\",\"\"))","v":""},{"$f":"IF(ISERROR(IF(D13=\"Loan amount available\",25%*#REF!,\"\")),\"\",IF(D13=\"Loan amount available\",25%*#REF!,\"\"))","v":""},"Interest rate","Deposited",null,"Month","Deposit","Balance","Interest",null,{"$f":"IF(INDEX('PPF Matuirty date Calculation'!$F$3:$G$18,MATCH('PPF Tracker'!J12,'PPF Matuirty date Calculation'!$G$3:$G$18,0),1)>5,\"Withdrawal\",\"No withdrawal possible\")","v":"No withdrawal possible"}]
[null,null,null,null,null,null,8.1000000000000003E-2,"before 5th",null,"Apr",5000,{"$f":"$M$9+IF(H14=\"before 5th\",K14,0)","v":126212},{"$f":"L14*G14/12","v":851.93100000000004}]
[null,null,null,null,null,null,{"$f":"G14","v":8.1000000000000003E-2},"before 5th",null,"May",5000,{"$f":"SUM($K$14:K14)+$M$9+IF(H15=\"before 5th\",K15,0)","v":131212},{"$f":"L15*G15/12","v":885.68100000000004},null,null,"PPF investment limit"]
[null,null,null,null,null,null,{"$f":"G15","v":8.1000000000000003E-2},"before 5th",null,"Jun",5000,{"$f":"SUM($K$14:K15)+$M$9+IF(H16=\"before 5th\",K16,0)","v":136212},919.43100000000004,null,null,150000]
[null,null,null,null,null,null,null,"before 5th",null,"Jul",5000,{"$f":"SUM($K$14:K16)+$M$9+IF(H17=\"before 5th\",K17,0)","v":141212},0,null,null,{"$f":"IF(SUM(K14:K25)>P16,\"Warning: total investment exceeds allowed limit\",\"\")","v":""}]
[null,null,null,null,null,null,{"$f":"G17","v":0},"before 5th",null,"Aug",5000,{"$f":"SUM($K$14:K17)+$M$9+IF(H18=\"before 5th\",K18,0)","v":146212},0]
[null,null,null,null,null,null,{"$f":"G18","v":0},"before 5th",null,"Sep",5000,{"$f":"SUM($K$14:K18)+$M$9+IF(H19=\"before 5th\",K19,0)","v":151212},0,null,null,{"$f":"IF(N26>Q13,\"Withdrawal is above limit\",\"\")","v":""}]
[null,null,null,null,null,null,null,"before 5th",null,"Oct",5000,{"$f":"SUM($K$14:K19)+$M$9+IF(H20=\"before 5th\",K20,0)","v":156212},0]
[null,null,null,null,null,null,{"$f":"G20","v":0},"before 5th",null,"Nov",5000,{"$f":"SUM($K$14:K20)+$M$9+IF(H21=\"before 5th\",K21,0)","v":161212},0]
[null,null,null,null,null,null,{"$f":"G21","v":0},"before 5th",null,"Dec",5000,{"$f":"SUM($K$14:K21)+$M$9+IF(H22=\"before 5th\",K22,0)","v":166212},0]
[null,null,null,null,null,null,null,"before 5th",null,"Jan",5000,{"$f":"SUM($K$14:K22)+$M$9+IF(H23=\"before 5th\",K23,0)","v":171212},0]
[null,null,null,null,null,null,{"$f":"G23","v":0},"before 5th",null,"Feb",5000,{"$f":"SUM($K$14:K23)+$M$9+IF(H24=\"before 5th\",K24,0)","v":176212},0]
[null,null,null,null,null,null,{"$f":"G24","v":0},"before 5th",null,"Mar",5000,{"$f":"SUM($K$14:K24)+$M$9+IF(H25=\"before 5th\",K25,0)","v":181212},0]
[null,null,null,{"$f":"D12","v":1},null,null,null,null,null,"Year End Balance",null,{"$f":"SUM(K14:K25)+SUM(M14:M25)+M9-N26","v":183869.04300000001},null,{"$f":"O14","v":0}]
[null,null,null,null,{"$f":"IF(DATE(MID(J28,4,4),4,1)>=$M$6,\"Account has matured. No further deposits are possible unless extended for 5Y years. Account can be kept alive without deposits\",\"\")","v":""}]
[null,null,null,{"$f":"IF(ISERROR(INDEX('PPF Matuirty date Calculation'!$F$3:$G$18,MATCH('PPF Tracker'!J28,'PPF Matuirty date Calculation'!$G$3:$G$18,0),1)),D26+1,INDEX('PPF Matuirty date Calculation'!$F$3:$G$18,MATCH('PPF Tracker'!J28,'PPF Matuirty date Calculation'!$G$3:$G$18,0),1))","v":2},null,null,null,null,2,{"$f":"CONCATENATE(\"FY \",$M$8+I28-1,\" - \",$M$8+I28)","v":"FY 2017 - 2018"},null,null,null,null,{"$f":"IF(ISERROR(CONCATENATE(INDEX('PPF Matuirty date Calculation'!$F$3:$G$18,MATCH('PPF Tracker'!J28,'PPF Matuirty date Calculation'!$G$3:$G$18,0),1),\"th financial year\")),CONCATENATE(D28,\"th financial year\"),CONCATENATE(INDEX('PPF Matuirty date Calculation'!$F$3:$G$18,MATCH('PPF Tracker'!J28,'PPF Matuirty date Calculation'!$G$3:$G$18,0),1),\"th financial year\"))","v":"2th financial year"}]
[null,null,null,null,{"$f":"IF(ISERROR(IF(AND(D28>=3,D28<=6),\"Loan amount available\",\"\")),\"\",IF(AND(D28>=3,D28<=6),\"Loan amount available\",\"\"))","v":""},{"$f":"IF(ISERROR(IF(D29=\"Loan amount available\",25%*L10,\"\")),\"\",IF(D29=\"Loan amount available\",25%*L10,\"\"))","v":""},"Interest rate","Deposited",null,"Month","Deposit","Balance","Interest",null,{"$f":"IF(ISERROR(IF(INDEX('PPF Matuirty date Calculation'!$F$3:$G$18,MATCH('PPF Tracker'!J28,'PPF Matuirty date Calculation'!$G$3:$G$18,0),1)>5,\"Withdrawal\",\"No withdrawal possible\")),\"no withdrawal limit\",IF(INDEX('PPF Matuirty date Calculation'!$F$3:$G$18,MATCH('PPF Tracker'!J28,'PPF Matuirty date Calculation'!$G$3:$G$18,0),1)>5,\"Withdrawal\",\"No withdrawal possible\"))","v":"No withdrawal possible"}]
[null,null,null,null,null,null,null,"before 5th",null,"Apr",null,{"$f":"$L$26+IF(H30=\"before 5th\",K30,0)","v":183869.04300000001},{"$f":"L30*G30/12","v":0}]
[null,null,null,null,null,null,0,"before 5th",null,"May",null,{"$f":"SUM($K$30:K30)+$L$26+IF(H31=\"before 5th\",K31,0)","v":183869.04300000001},{"$f":"L31*G31/12","v":0},null,null,"PPF investment limit"]
[null,null,null,null,null,null,{"$f":"G31","v":0},"before 5th",null,"Jun",null,{"$f":"SUM($K$30:K31)+$L$26+IF(H32=\"before 5th\",K32,0)","v":183869.04300000001},0,null,null,150000]
[null,null,null,null,null,null,null,"before 5th",null,"Jul",null,{"$f":"SUM($K$30:K32)+$L$26+IF(H33=\"before 5th\",K33,0)","v":183869.04300000001},0,null,null,{"$f":"IF(SUM(K30:K41)>P32,\"Warning: total investment exceeds allowed limit\",\"\")","v":""}]
[null,null,null,null,null,null,{"$f":"G33","v":0},"before 5th",null,"Aug",null,{"$f":"SUM($K$30:K33)+$L$26+IF(H34=\"before 5th\",K34,0)","v":183869.04300000001},0]
[null,null,null,null,null,null,{"$f":"G34","v":0},"before 5th",null,"Sep",null,{"$f":"SUM($K$30:K34)+$L$26+IF(H35=\"before 5th\",K35,0)","v":183869.04300000001},0,null,null,{"$f":"IF(N42>Q29,\"Withdrawal is above limit\",\"\")","v":""}]
[null,null,null,null,null,null,null,"before 5th",null,"Oct",null,{"$f":"SUM($K$30:K35)+$L$26+IF(H36=\"before 5th\",K36,0)","v":183869.04300000001},0]
[null,null,null,null,null,null,{"$f":"G36","v":0},"before 5th",null,"Nov",null,{"$f":"SUM($K$30:K36)+$L$26+IF(H37=\"before 5th\",K37,0)","v":183869.04300000001},0]
[null,null,null,null,null,null,{"$f":"G37","v":0},"before 5th",null,"Dec",null,{"$f":"SUM($K$30:K37)+$L$26+IF(H38=\"before 5th\",K38,0)","v":183869.04300000001},0]
[null,null,null,null,null,null,null,"before 5th",null,"Jan",null,{"$f":"SUM($K$30:K38)+$L$26+IF(H39=\"before 5th\",K39,0)","v":183869.04300000001},0]
[null,null,null,null,null,null,{"$f":"G39","v":0},"before 5th",null,"Feb",null,{"$f":"SUM($K$30:K39)+$L$26+IF(H40=\"before 5th\",K40,0)","v":183869.04300000001},0]
{"$rows_left_out":291}
{"sheet":"Post 15 yearsTracker ","index":4,"n_rows":171,"n_cols":30,"rows_kept":171,"cut":false,"hidden":false,"merged":[[1,3,2,18],[7,4,7,5],[7,16,7,17],[12,9,12,12],[28,9,28,12],[5,9,5,11],[44,9,44,12],[60,9,60,12],[156,9,156,12],[76,9,76,12],[92,9,92,12],[108,9,108,12],[124,9,124,12],[140,9,140,12]]}
[null,null,null,null,null,null,null,null,null,null,null,null,null,null,null,null,null,null,null,null,null,null,null,null,null,null,null,null,null,"before 5th"]
[null,null,null,"Use this sheet to track your PPF if you have extended it at the end of the 15 year period",null,null,null,null,null,null,null,null,null,null,null,null,null,null,null,null,null,null,null,null,null,null,null,null,null,"after 5th"]
[]
[]
[null,null,null,null,"Enter data only in green cells",null,null,null,null,"Account extension date ",null,null,{"$f":"'PPF Matuirty date Calculation'!B9","v":"2031-04-01"},"This has to be entered in \"PPF Matuirty date Calculation\" sheet"]
[null,null,null,null,null,null,null,null,null,"Maturity Date",null,null,{"$f":"'PPF Matuirty date Calculation'!B11","v":"2036-04-01"}]
[]
[null,null,null,null,null,null,null,null,null,"Opening Balance on March 31st of",null,null,2015]
[]
[null,null,null,null,null,null,null,null,null,"Balance at the start of 5Y extension block"]
[null,null,null,null,null,null,null,null,null,null,null,469108]
[]
[null,null,null,null,null,null,null,null,1,{"$f":"CONCATENATE(\"FY \",$M$8+I13-1,\" - \",$M$8+I13)","v":"FY 2015 - 2016"},null,null,null,null,"Withdrawal can be made only once in a year"]
[null,null,null,null,null,null,"Interest rate","Deposited",null,"Month","Deposit","Balance","Interest",null,"Withdrawal"]
[null,null,null,null,null,null,8.1000000000000003E-2,"before 5th",null,"Apr",5000,{"$f":"$L$11+IF(H15=\"before 5th\",K15,0)","v":474108},{"$f":"L15*G15/12","v":3200.2289999999998}]
[null,null,null,"Withdrawal limit",null,{"$f":"60%*$L$11","v":281464.8},{"$f":"G15","v":8.1000000000000003E-2},"before 5th",null,"May",5000,{"$f":"SUM($K$15:K15)+$L$11+IF(H16=\"before 5th\",K16,0)","v":479108},{"$f":"L16*G16/12","v":3233.9789999999998},null,null,"PPF investment limit"]
[null,null,null,null,null,null,{"$f":"G16","v":8.1000000000000003E-2},"before 5th",null,"Jun",5000,{"$f":"SUM($K$15:K16)+$L$11+IF(H17=\"before 5th\",K17,0)","v":484108},3267.7289999999998,null,null,150000]
[null,null,null,null,null,null,null,"before 5th",null,"Jul",5000,{"$f":"SUM($K$15:K17)+$L$11+IF(H18=\"before 5th\",K18,0)","v":489108},0,null,null,{"$f":"IF(SUM(K15:K26)>P17,\"Warning: total investment exceeds allowed limit\",\"\")","v":""}]
[null,null,null,null,null,null,{"$f":"G18","v":0},"before 5th",null,"Aug",5000,{"$f":"SUM($K$15:K18)+$L$11+IF(H19=\"before 5th\",K19,0)","v":494108},0]
[null,null,null,null,null,null,{"$f":"G19","v":0},"before 5th",null,"Sep",5000,{"$f":"SUM($K$15:K19)+$L$11+IF(H20=\"before 5th\",K20,0)","v":499108},0,null,null,{"$f":"IF(N27>F16,\"Withdrawal is above limit\",\"\")","v":""}]
[null,null,null,null,null,null,null,"before 5th",null,"Oct",5000,{"$f":"SUM($K$15:K20)+$L$11+IF(H21=\"before 5th\",K21,0)","v":504108},0]
[null,null,null,null,null,null,{"$f":"G21","v":0},"before 5th",null,"Nov",5000,{"$f":"SUM($K$15:K21)+$L$11+IF(H22=\"before 5th\",K22,0)","v":509108},0]
[null,null,null,null,null,null,{"$f":"G22","v":0},"before 5th",null,"Dec",5000,{"$f":"SUM($K$15:K22)+$L$11+IF(H23=\"before 5th\",K23,0)","v":514108},0]
[null,null,null,null,null,null,null,"before 5th",null,"Jan",5000,{"$f":"SUM($K$15:K23)+$L$11+IF(H24=\"before 5th\",K24,0)","v":519108},0]
[null,null,null,null,null,null,{"$f":"G24","v":0},"before 5th",null,"Feb",5000,{"$f":"SUM($K$15:K24)+$L$11+IF(H25=\"before 5th\",K25,0)","v":524108},0]
[null,null,null,null,null,null,{"$f":"G25","v":0},"before 5th",null,"Mar",5000,{"$f":"SUM($K$15:K25)+$L$11+IF(H26=\"before 5th\",K26,0)","v":529108},0]
[null,null,null,null,null,null,null,null,null,"Year End Balance",null,{"$f":"SUM(K15:K26)+SUM(M15:M26)+L11-N27","v":538809.93700000003},null,{"$f":"O15","v":0}]
[]
[null,null,null,null,null,null,null,null,2,{"$f":"CONCATENATE(\"FY \",$M$8+I29-1,\" - \",$M$8+I29)","v":"FY 2016 - 2017"},null,null,null,null,"Withdrawal can be made only once in a year"]
[null,null,null,null,null,null,"Interest rate","Deposited",null,"Month","Deposit","Balance","Interest",null,"Withdrawal"]
[null,null,null,null,null,null,null,"before 5th",null,"Apr",5000,{"$f":"$L$27+IF(H31=\"before 5th\",K31,0)","v":543809.93700000003},{"$f":"L31*G31/12","v":0}]
[null,null,null,"Withdrawal limit",null,{"$f":"60%*$L$11","v":281464.8},{"$f":"G31","v":0},"before 5th",null,"May",5000,{"$f":"SUM($K$31:K31)+$L$27+IF(H32=\"before 5th\",K32,0)","v":548809.93700000003},{"$f":"L32*G32/12","v":0},null,null,"PPF investment limit"]
[null,null,null,null,null,null,{"$f":"G32","v":0},"before 5th",null,"Jun",5000,{"$f":"SUM($K$31:K32)+$L$27+IF(H33=\"before 5th\",K33,0)","v":553809.93700000003},0,null,null,150000]
[null,null,null,null,null,null,null,"before 5th",null,"Jul",5000,{"$f":"SUM($K$31:K33)+$L$27+IF(H34=\"before 5th\",K34,0)","v":558809.93700000003},0,null,null,{"$f":"IF(SUM(K31:K42)>P33,\"Warning: total investment exceeds allowed limit\",\"\")","v":""}]
[null,null,null,null,null,null,{"$f":"G34","v":0},"before 5th",null,"Aug",5000,{"$f":"SUM($K$31:K34)+$L$27+IF(H35=\"before 5th\",K35,0)","v":563809.93700000003},0]
[null,null,null,null,null,null,{"$f":"G35","v":0},"before 5th",null,"Sep",5000,{"$f":"SUM($K$31:K35)+$L$27+IF(H36=\"before 5th\",K36,0)","v":568809.93700000003},0,null,null,{"$f":"IF(N43>F32,\"Withdrawal is above limit\",\"\")","v":""}]
[null,null,null,null,null,null,null,"before 5th",null,"Oct",5000,{"$f":"SUM($K$31:K36)+$L$27+IF(H37=\"before 5th\",K37,0)","v":573809.93700000003},0]
[null,null,null,null,null,null,{"$f":"G37","v":0},"before 5th",null,"Nov",5000,{"$f":"SUM($K$31:K37)+$L$27+IF(H38=\"before 5th\",K38,0)","v":578809.93700000003},0]
[null,null,null,null,null,null,{"$f":"G38","v":0},"before 5th",null,"Dec",5000,{"$f":"SUM($K$31:K38)+$L$27+IF(H39=\"before 5th\",K39,0)","v":583809.93700000003},0]
[null,null,null,null,null,null,null,"before 5th",null,"Jan",5000,{"$f":"SUM($K$31:K39)+$L$27+IF(H40=\"before 5th\",K40,0)","v":588809.93700000003},0]
{"$rows_left_out":131}