{"text_format":"1","workbook":"xlsx","n_sheets":6,"sheets":["Main","Results-simple","Results-advanced","mf1","mf2","mf3"],"not_rendered":{"charts":1,"images":0,"macros":1,"external_links":0,"defined_names":95,"comments":0,"pivot_tables":0},"unopened":[],"bounds":{"document_bytes":16777216,"sheet_cells":100000,"rows_first":2000,"rows_last":500,"rows_between":2000,"halvings":0,"cell_chars":16384,"cell_head_chars":4096},"cells_cut":0,"cells_raw":0,"read":"whole","date_system":"1900"}

{"sheet":"Main","index":0,"n_rows":750,"n_cols":38,"rows_kept":750,"cut":false,"hidden":false,"merged":[[25,1,25,6],[25,7,25,10],[25,11,27,11],[27,5,27,10],[2,1,2,11],[20,1,20,6],[20,7,20,10],[20,11,22,11],[22,5,22,10],[3,1,3,11],[10,11,12,11],[5,11,7,11],[15,1,15,6],[15,7,15,10],[15,11,17,11],[5,1,5,6],[5,7,5,10],[10,1,10,6],[10,7,10,10],[17,5,17,10],[12,1,12,4],[12,5,12,10],[23,1,23,5],[24,1,24,4],[7,1,7,4],[7,5,7,10],[6,1,6,10],[11,1,11,10],[32,2,32,3],[33,2,33,3],[34,2,34,3],[30,2,30,3],[31,2,31,3],[30,4,30,5],[31,4,31,5],[32,4,32,5],[33,4,33,5],[34,4,34,5]]}
[null,null,null,null,null,null,null,null,null,null,null,null,null,"MF3","MF2","MF1",null,null,null,{"$f":"INDEX(Q2:R750,MATCH(F8,Q2:Q750,0),2)","v":16501},"mf1","wrt cat avg",{"$f":"IF(VALUE(C12)>C16,1,0)","v":0},{"$f":"IF(VALUE(D12)>D16,1,0)","v":0},{"$f":"IF(VALUE(E12)>E16,1,0)","v":0},{"$f":"IF(VALUE(F12)>F16,1,0)","v":0},{"$f":"IF(VALUE(G12)>G16,1,0)","v":0},null,{"$f":"SUM(W1:AA1)","v":0},null,"mf1",{"$f":"COUNTIF(AE2:AE749,\"?*\")","v":2},null,"No",null,"mf2",null,"mf3"]
[null,null,null,null,null,null,null,null,null,null,null,null,null,{"$f":"IF(ISNUMBER(SEARCH($H$16,Q2)),MAX($N$1,N1)+1,0)","v":0},{"$f":"IF(ISNUMBER(SEARCH($H$11,Q2)),MAX($O$1,O1)+1,0)","v":0},{"$f":"IF(ISNUMBER(SEARCH($H$6,Q2)),MAX($P$1,P1)+1,0)","v":0},"Axis Equity",10780,null,{"$f":"INDEX(Q2:R750,MATCH(F13,Q2:Q750,0),2)","v":114},"mf2","wrt sensex",{"$f":"IF(VALUE(C12)>C18,1,0)","v":0},{"$f":"IF(VALUE(D12)>D18,1,0)","v":0},{"$f":"IF(VALUE(E12)>E18,1,0)","v":0},{"$f":"IF(VALUE(F12)>F18,1,0)","v":0},{"$f":"IF(VALUE(G12)>G18,1,0)","v":0},null,{"$f":"SUM(W2:AA2)","v":0},null,{"$f":"IFERROR(VLOOKUP(ROWS($AE$2:AE2),P2:Q750,2,0),\"\")","v":"IDFC Premier Equity Direct"},{"$f":"OFFSET(AE2,,,COUNTIF($AE$2:$AE$749,\"?*\"),)","v":"IDFC Premier Equity Direct"},null,"Yes",null,{"$f":"IFERROR(VLOOKUP(ROWS($AJ$2:AJ2),O2:Q750,3,0),\"\")","v":"Franklin India Bluechip"},null,{"$f":"IFERROR(VLOOKUP(ROWS(AL$2:$AL2),N2:Q750,4,0),\"\")","v":"Quantum Long Term Equity"}]
[null,"Mutual Fund Portfolio Comparison Tool",null,null,null,null,null,null,null,null,null,null,null,{"$f":"IF(ISNUMBER(SEARCH($H$16,Q3)),MAX($N$1,N2)+1,0)","v":0},{"$f":"IF(ISNUMBER(SEARCH($H$11,Q3)),MAX($O$1,O2)+1,0)","v":0},0,"Axis Equity Direct",15682,null,{"$f":"INDEX(Q2:R750,MATCH(F18,Q2:Q750,0),2)","v":3181},"mf3","wrt Nifty",{"$f":"IF(VALUE(C12)>C22,1,0)","v":0},{"$f":"IF(VALUE(D12)>D22,1,0)","v":0},{"$f":"IF(VALUE(E12)>E22,1,0)","v":0},{"$f":"IF(VALUE(F12)>F22,1,0)","v":0},{"$f":"IF(VALUE(G12)>G22,1,0)","v":0},null,{"$f":"SUM(W3:AA3)","v":0},null,{"$f":"IFERROR(VLOOKUP(ROWS($AE$2:AE3),P3:Q751,2,0),\"\")","v":"IDFC Premier Equity Regular"},null,{"$f":"F8","v":"IDFC Premier Equity Direct"},null,null,{"$f":"IFERROR(VLOOKUP(ROWS($AJ$2:AJ3),O3:Q751,3,0),\"\")","v":"Franklin India Bluechip Direct"},null,{"$f":"IFERROR(VLOOKUP(ROWS(AL$2:$AL3),N3:Q751,4,0),\"\")","v":""}]
[null,null,null,null,null,null,null,null,null,null,null,null,null,0,0,0,"Axis Focused 25",14951,null,null,null,null,{"$f":"SUM(W1:W3)","v":0},{"$f":"SUM(X1:X3)","v":0},{"$f":"SUM(Y1:Y3)","v":0},{"$f":"SUM(Z1:Z3)","v":0},{"$f":"SUM(AA1:AA3)","v":0},null,null,null,{"$f":"IFERROR(VLOOKUP(ROWS($AE$2:AE4),P4:Q752,2,0),\"\")","v":""},null,null,null,null,{"$f":"IFERROR(VLOOKUP(ROWS(AJ$2:$AJ4),O4:Q752,3,0),\"\")","v":"Franklin India Flexi Cap"},null,{"$f":"IFERROR(VLOOKUP(ROWS(AL$2:$AL4),N4:Q752,4,0),\"\")","v":""}]
[null,null,null,null,null,null,null,null,null,null,null,null,null,0,0,0,"Axis Focused 25 Direct",15684,null,null,null,null,null,null,null,null,null,null,null,null,{"$f":"IFERROR(VLOOKUP(ROWS($AE$2:AE5),P5:Q753,2,0),\"\")","v":""},null,null,null,null,{"$f":"IFERROR(VLOOKUP(ROWS(AJ$2:$AJ5),O5:Q753,3,0),\"\")","v":"Franklin India Flexi Cap Direct"},null,{"$f":"IFERROR(VLOOKUP(ROWS(AL$2:$AL5),N5:Q753,4,0),\"\")","v":""}]
[null,"Type the first few letters of the MF scheme you need in the green area. ",null,null,null,null,null,"idfc pre",null,null,null,"MF1",null,0,0,0,"Axis Long Term Equity",10826,null,null,null,null,null,null,null,null,null,null,null,null,{"$f":"IFERROR(VLOOKUP(ROWS($AE$2:AE6),P6:Q754,2,0),\"\")","v":""},null,null,null,null,{"$f":"IFERROR(VLOOKUP(ROWS(AJ$2:$AJ6),O6:Q754,3,0),\"\")","v":"Franklin India High Growth Companies"},null,{"$f":"IFERROR(VLOOKUP(ROWS(AL$2:$AL6),N6:Q754,4,0),\"\")","v":""}]
{"$rows_left_out":745}
{"sheet":"Results-simple","index":1,"n_rows":61,"n_cols":31,"rows_kept":61,"cut":false,"hidden":false,"merged":[[0,23,0,28],[23,1,24,1],[17,1,18,1],[0,16,0,20],[20,1,21,1],[13,1,14,1],[13,2,14,2],[13,3,14,3],[0,9,0,14],[17,2,18,2],[17,3,18,3]]}
[null,null,null,null,null,null,null,null,null,"mf1 vsmf2",null,null,null,null,null,null,"mf2 vsmf3",null,null,null,null,null,null,"mf1 vsmf3"]
[null,{"$f":"'mf1'!A1","v":"IDFC Premier Equity Direct"},{"$f":"'mf2'!A1","v":"Franklin India Bluechip"},{"$f":"'mf3'!A1","v":"Quantum Long Term Equity"},null,null,null,null,1,{"$f":"INDEX('mf2'!$B$27:$B$51,MATCH('mf1'!B27,'mf2'!$B$27:$B$51,0),1)","v":{"$error":"#N/A"}},{"$f":"INDEX('mf2'!$B$27:$G$51,MATCH('mf1'!B27,'mf2'!$B$27:$B$51,0),6)","v":{"$error":"#N/A"}},{"$f":"IF(ISERROR(INDEX('mf2'!$B$27:$B$51,MATCH('mf1'!B27,'mf2'!$B$27:$B$51,0),1)),0,1)","v":0},{"$f":"INDEX('mf1'!$B$27:$B$51,MATCH('mf2'!B27,'mf1'!$B$27:$B$51,0),1)","v":{"$error":"#N/A"}},{"$f":"INDEX('mf1'!$B$27:$G$51,MATCH('mf2'!B27,'mf1'!$B$27:$B$51,0),6)","v":{"$error":"#N/A"}},{"$f":"IF(ISERROR(J2),IF(ISERROR(J3),IF(ISERROR(J4),IF(ISERROR(J5),IF(ISERROR(J6),IF(ISERROR(J7),IF(ISERROR(J8),IF(ISERROR(J9),IF(ISERROR(J10),IF(ISERROR(J11),IF(ISERROR(J12),IF(ISERROR(J13),IF(ISERROR(J14),IF(ISERROR(J15),IF(ISERROR(J16),IF(ISERROR(J17),IF(ISERROR(J18),IF(ISERROR(J19),IF(ISERROR(J20),IF(ISERROR(J21),IF(ISERROR(J22),IF(ISERROR(J23),IF(ISERROR(J24),IF(ISERROR(J25),\"\",J25),J24),J23),J22),J21),J20),J19),J18),J17),J16),J15),J16),J13),J12),J11),J10),J9),J8),J7),J6),J5),J4),J3),J2)","v":"Asian Paints"},null,{"$f":"INDEX('mf3'!$B$27:$B$51,MATCH('mf2'!B27,'mf3'!$B$27:$B$51,0),1)","v":"Infosys"},{"$f":"INDEX('mf3'!$B$27:$G$51,MATCH('mf2'!B27,'mf3'!$B$27:$B$51,0),6)","v":5.05},{"$f":"IF(ISERROR(INDEX('mf3'!$B$27:$B$51,MATCH('mf2'!B27,'mf3'!$B$27:$B$51,0),1)),0,1)","v":1},{"$f":"INDEX('mf2'!$B$27:$B$51,MATCH('mf3'!B27,'mf2'!$B$27:$B$51,0),1)","v":"HDFC"},{"$f":"INDEX('mf2'!$B$27:$G$51,MATCH('mf3'!B27,'mf2'!$B$27:$B$51,0),6)","v":2.09},{"$f":"IF(ISERROR(Q2),IF(ISERROR(Q3),IF(ISERROR(Q4),IF(ISERROR(Q5),IF(ISERROR(Q6),IF(ISERROR(Q7),IF(ISERROR(Q8),IF(ISERROR(Q9),IF(ISERROR(Q10),IF(ISERROR(Q11),IF(ISERROR(Q12),IF(ISERROR(Q13),IF(ISERROR(Q14),IF(ISERROR(Q15),IF(ISERROR(Q16),IF(ISERROR(Q17),IF(ISERROR(Q18),IF(ISERROR(Q19),IF(ISERROR(Q20),IF(ISERROR(Q21),IF(ISERROR(Q22),IF(ISERROR(Q23),IF(ISERROR(Q24),IF(ISERROR(Q25),\"\",Q25),Q24),Q23),Q22),Q21),Q20),Q19),Q18),Q17),Q16),Q15),Q16),Q13),Q12),Q11),Q10),Q9),Q8),Q7),Q6),Q5),Q4),Q3),Q2)","v":"Infosys"},null,{"$f":"INDEX('mf3'!$B$27:$B$51,MATCH('mf1'!B27,'mf3'!$B$27:$B$51,0),1)","v":{"$error":"#N/A"}},{"$f":"INDEX('mf3'!$B$27:$G$51,MATCH('mf1'!B27,'mf3'!$B$27:$B$51,0),6)","v":{"$error":"#N/A"}},{"$f":"IF(ISERROR(INDEX('mf3'!$B$27:$B$51,MATCH('mf1'!B27,'mf3'!$B$27:$B$51,0),1)),0,1)","v":0},{"$f":"INDEX('mf1'!$B$27:$B$51,MATCH('mf3'!B27,'mf1'!$B$27:$B$51,0),1)","v":{"$error":"#N/A"}},{"$f":"INDEX('mf1'!$B$27:$G$51,MATCH('mf3'!B27,'mf1'!$B$27:$B$51,0),6)","v":{"$error":"#N/A"}},{"$f":"IF(ISERROR(X2),IF(ISERROR(X3),IF(ISERROR(X4),IF(ISERROR(X5),IF(ISERROR(X6),IF(ISERROR(X7),IF(ISERROR(X8),IF(ISERROR(X9),IF(ISERROR(X10),IF(ISERROR(X11),IF(ISERROR(X12),IF(ISERROR(X13),IF(ISERROR(X14),IF(ISERROR(X15),IF(ISERROR(X16),IF(ISERROR(X17),IF(ISERROR(X18),IF(ISERROR(X19),IF(ISERROR(X20),IF(ISERROR(X21),IF(ISERROR(X22),IF(ISERROR(X23),IF(ISERROR(X24),IF(ISERROR(X25),\"\",X25),X24),X23),X22),X21),X20),X19),X18),X17),X16),X15),X16),X13),X12),X11),X10),X9),X8),X7),X6),X5),X4),X3),X2)","v":"GAIL"},null,{"$f":"INDEX(mutualfund3s,MATCH(0,COUNTIF($AE$1:AE1,mutualfund3s),0))","v":"Infosys"}]
["Category:",{"$f":"'mf1'!B4","v":"Equity: Mid & Small Cap"},{"$f":"'mf2'!B4","v":"Equity: Large Cap"},{"$f":"'mf3'!B4","v":"Equity: Large & Mid Cap"},null,null,null,null,{"$f":"I2+1","v":2},{"$f":"INDEX('mf2'!$B$27:$B$51,MATCH('mf1'!B28,'mf2'!$B$27:$B$51,0),1)","v":{"$error":"#N/A"}},{"$f":"INDEX('mf2'!$B$27:$G$51,MATCH('mf1'!B28,'mf2'!$B$27:$B$51,0),6)","v":{"$error":"#N/A"}},{"$f":"IF(ISERROR(INDEX('mf2'!$B$27:$B$51,MATCH('mf1'!B28,'mf2'!$B$27:$B$51,0),1)),0,1)","v":0},{"$f":"INDEX('mf1'!$B$27:$B$51,MATCH('mf2'!B28,'mf1'!$B$27:$B$51,0),1)","v":{"$error":"#N/A"}},{"$f":"INDEX('mf1'!$B$27:$G$51,MATCH('mf2'!B28,'mf1'!$B$27:$B$51,0),6)","v":{"$error":"#N/A"}},"Asian Paints",null,{"$f":"INDEX('mf3'!$B$27:$B$51,MATCH('mf2'!B28,'mf3'!$B$27:$B$51,0),1)","v":{"$error":"#N/A"}},{"$f":"INDEX('mf3'!$B$27:$G$51,MATCH('mf2'!B28,'mf3'!$B$27:$B$51,0),6)","v":{"$error":"#N/A"}},{"$f":"IF(ISERROR(INDEX('mf3'!$B$27:$B$51,MATCH('mf2'!B28,'mf3'!$B$27:$B$51,0),1)),0,1)","v":0},{"$f":"INDEX('mf2'!$B$27:$B$51,MATCH('mf3'!B28,'mf2'!$B$27:$B$51,0),1)","v":{"$error":"#N/A"}},{"$f":"INDEX('mf2'!$B$27:$G$51,MATCH('mf3'!B28,'mf2'!$B$27:$B$51,0),6)","v":{"$error":"#N/A"}},"ONGC",null,{"$f":"INDEX('mf3'!$B$27:$B$51,MATCH('mf1'!B28,'mf3'!$B$27:$B$51,0),1)","v":{"$error":"#N/A"}},{"$f":"INDEX('mf3'!$B$27:$G$51,MATCH('mf1'!B28,'mf3'!$B$27:$B$51,0),6)","v":{"$error":"#N/A"}},{"$f":"IF(ISERROR(INDEX('mf3'!$B$27:$B$51,MATCH('mf1'!B28,'mf3'!$B$27:$B$51,0),1)),0,1)","v":0},{"$f":"INDEX('mf1'!$B$27:$B$51,MATCH('mf3'!B28,'mf1'!$B$27:$B$51,0),1)","v":{"$error":"#N/A"}},{"$f":"INDEX('mf1'!$B$27:$G$51,MATCH('mf3'!B28,'mf1'!$B$27:$B$51,0),6)","v":{"$error":"#N/A"}},{"$f":"IF(ISERROR(X3),IF(ISERROR(X4),IF(ISERROR(X5),IF(ISERROR(X6),IF(ISERROR(X7),IF(ISERROR(X8),IF(ISERROR(X9),IF(ISERROR(X10),IF(ISERROR(X11),IF(ISERROR(X12),IF(ISERROR(X13),IF(ISERROR(X14),IF(ISERROR(X15),IF(ISERROR(X16),IF(ISERROR(X17),IF(ISERROR(X18),IF(ISERROR(X19),IF(ISERROR(X20),IF(ISERROR(X21),IF(ISERROR(X22),IF(ISERROR(X23),IF(ISERROR(X24),IF(ISERROR(X25),IF(ISERROR(X26),\"\",X26),X25),X24),X23),X22),X21),X20),X19),X18),X17),X16),X17),X14),X13),X12),X11),X10),X9),X8),X7),X6),X5),X4),X3)","v":"GAIL"},null,{"$f":"INDEX(mutualfund3s,MATCH(0,COUNTIF($AE$1:AE2,mutualfund3s),0))","v":"ONGC"}]
["Net Assets:",{"$f":"'mf1'!B5","v":"R 3,448 crore (As on Dec 31, 2013)"},{"$f":"'mf2'!B5","v":"R 4,958 crore (As on Dec 31, 2013)"},{"$f":"'mf3'!B5","v":"R 201 crore (As on Dec 31, 2013)"},null,null,null,null,{"$f":"I3+1","v":3},{"$f":"INDEX('mf2'!$B$27:$B$51,MATCH('mf1'!B29,'mf2'!$B$27:$B$51,0),1)","v":{"$error":"#N/A"}},{"$f":"INDEX('mf2'!$B$27:$G$51,MATCH('mf1'!B29,'mf2'!$B$27:$B$51,0),6)","v":{"$error":"#N/A"}},{"$f":"IF(ISERROR(INDEX('mf2'!$B$27:$B$51,MATCH('mf1'!B29,'mf2'!$B$27:$B$51,0),1)),0,1)","v":0},{"$f":"INDEX('mf1'!$B$27:$B$51,MATCH('mf2'!B29,'mf1'!$B$27:$B$51,0),1)","v":{"$error":"#N/A"}},{"$f":"INDEX('mf1'!$B$27:$G$51,MATCH('mf2'!B29,'mf1'!$B$27:$B$51,0),6)","v":{"$error":"#N/A"}},"Asian Paints",null,{"$f":"INDEX('mf3'!$B$27:$B$51,MATCH('mf2'!B29,'mf3'!$B$27:$B$51,0),1)","v":{"$error":"#N/A"}},{"$f":"INDEX('mf3'!$B$27:$G$51,MATCH('mf2'!B29,'mf3'!$B$27:$B$51,0),6)","v":{"$error":"#N/A"}},{"$f":"IF(ISERROR(INDEX('mf3'!$B$27:$B$51,MATCH('mf2'!B29,'mf3'!$B$27:$B$51,0),1)),0,1)","v":0},{"$f":"INDEX('mf2'!$B$27:$B$51,MATCH('mf3'!B29,'mf2'!$B$27:$B$51,0),1)","v":"Infosys"},{"$f":"INDEX('mf2'!$B$27:$G$51,MATCH('mf3'!B29,'mf2'!$B$27:$B$51,0),6)","v":9.7899999999999991},"ONGC",null,{"$f":"INDEX('mf3'!$B$27:$B$51,MATCH('mf1'!B29,'mf3'!$B$27:$B$51,0),1)","v":{"$error":"#N/A"}},{"$f":"INDEX('mf3'!$B$27:$G$51,MATCH('mf1'!B29,'mf3'!$B$27:$B$51,0),6)","v":{"$error":"#N/A"}},{"$f":"IF(ISERROR(INDEX('mf3'!$B$27:$B$51,MATCH('mf1'!B29,'mf3'!$B$27:$B$51,0),1)),0,1)","v":0},{"$f":"INDEX('mf1'!$B$27:$B$51,MATCH('mf3'!B29,'mf1'!$B$27:$B$51,0),1)","v":{"$error":"#N/A"}},{"$f":"INDEX('mf1'!$B$27:$G$51,MATCH('mf3'!B29,'mf1'!$B$27:$B$51,0),6)","v":{"$error":"#N/A"}},"GAIL",null,{"$f":"INDEX(mutualfund3s,MATCH(0,COUNTIF($AE$1:AE3,mutualfund3s),0))","v":"NTPC"}]
["Expense:",{"$f":"'mf1'!B6","v":"1.50% (As on Sep 30, 2013)"},{"$f":"'mf2'!B6","v":"2.16% (As on Sep 30, 2013)"},{"$f":"'mf3'!B6","v":"1.25% (As on Sep 30, 2013)"},null,null,null,null,4,{"$f":"INDEX('mf2'!$B$27:$B$51,MATCH('mf1'!B30,'mf2'!$B$27:$B$51,0),1)","v":{"$error":"#N/A"}},{"$f":"INDEX('mf2'!$B$27:$G$51,MATCH('mf1'!B30,'mf2'!$B$27:$B$51,0),6)","v":{"$error":"#N/A"}},{"$f":"IF(ISERROR(INDEX('mf2'!$B$27:$B$51,MATCH('mf1'!B30,'mf2'!$B$27:$B$51,0),1)),0,1)","v":0},{"$f":"INDEX('mf1'!$B$27:$B$51,MATCH('mf2'!B30,'mf1'!$B$27:$B$51,0),1)","v":{"$error":"#N/A"}},{"$f":"INDEX('mf1'!$B$27:$G$51,MATCH('mf2'!B30,'mf1'!$B$27:$B$51,0),6)","v":{"$error":"#N/A"}},"Asian Paints",null,{"$f":"INDEX('mf3'!$B$27:$B$51,MATCH('mf2'!B30,'mf3'!$B$27:$B$51,0),1)","v":{"$error":"#N/A"}},{"$f":"INDEX('mf3'!$B$27:$G$51,MATCH('mf2'!B30,'mf3'!$B$27:$B$51,0),6)","v":{"$error":"#N/A"}},{"$f":"IF(ISERROR(INDEX('mf3'!$B$27:$B$51,MATCH('mf2'!B30,'mf3'!$B$27:$B$51,0),1)),0,1)","v":0},{"$f":"INDEX('mf2'!$B$27:$B$51,MATCH('mf3'!B30,'mf2'!$B$27:$B$51,0),1)","v":{"$error":"#N/A"}},{"$f":"INDEX('mf2'!$B$27:$G$51,MATCH('mf3'!B30,'mf2'!$B$27:$B$51,0),6)","v":{"$error":"#N/A"}},"ONGC",null,{"$f":"INDEX('mf3'!$B$27:$B$51,MATCH('mf1'!B30,'mf3'!$B$27:$B$51,0),1)","v":{"$error":"#N/A"}},{"$f":"INDEX('mf3'!$B$27:$G$51,MATCH('mf1'!B30,'mf3'!$B$27:$B$51,0),6)","v":{"$error":"#N/A"}},{"$f":"IF(ISERROR(INDEX('mf3'!$B$27:$B$51,MATCH('mf1'!B30,'mf3'!$B$27:$B$51,0),1)),0,1)","v":0},{"$f":"INDEX('mf1'!$B$27:$B$51,MATCH('mf3'!B30,'mf1'!$B$27:$B$51,0),1)","v":{"$error":"#N/A"}},{"$f":"INDEX('mf1'!$B$27:$G$51,MATCH('mf3'!B30,'mf1'!$B$27:$B$51,0),6)","v":{"$error":"#N/A"}},"GAIL",null,{"$f":"INDEX(mutualfund3s,MATCH(0,COUNTIF($AE$1:AE4,mutualfund3s),0))","v":"Larsen & Toubro"}]
[null,null,null,null,null,null,null,null,5,{"$f":"INDEX('mf2'!$B$27:$B$51,MATCH('mf1'!B31,'mf2'!$B$27:$B$51,0),1)","v":{"$error":"#N/A"}},{"$f":"INDEX('mf2'!$B$27:$G$51,MATCH('mf1'!B31,'mf2'!$B$27:$B$51,0),6)","v":{"$error":"#N/A"}},{"$f":"IF(ISERROR(INDEX('mf2'!$B$27:$B$51,MATCH('mf1'!B31,'mf2'!$B$27:$B$51,0),1)),0,1)","v":0},{"$f":"INDEX('mf1'!$B$27:$B$51,MATCH('mf2'!B31,'mf1'!$B$27:$B$51,0),1)","v":"HDFC Bank"},{"$f":"INDEX('mf1'!$B$27:$G$51,MATCH('mf2'!B31,'mf1'!$B$27:$B$51,0),6)","v":1.93},"Asian Paints",null,{"$f":"INDEX('mf3'!$B$27:$B$51,MATCH('mf2'!B31,'mf3'!$B$27:$B$51,0),1)","v":{"$error":"#N/A"}},{"$f":"INDEX('mf3'!$B$27:$G$51,MATCH('mf2'!B31,'mf3'!$B$27:$B$51,0),6)","v":{"$error":"#N/A"}},{"$f":"IF(ISERROR(INDEX('mf3'!$B$27:$B$51,MATCH('mf2'!B31,'mf3'!$B$27:$B$51,0),1)),0,1)","v":0},{"$f":"INDEX('mf2'!$B$27:$B$51,MATCH('mf3'!B31,'mf2'!$B$27:$B$51,0),1)","v":{"$error":"#N/A"}},{"$f":"INDEX('mf2'!$B$27:$G$51,MATCH('mf3'!B31,'mf2'!$B$27:$B$51,0),6)","v":{"$error":"#N/A"}},"ONGC",null,{"$f":"INDEX('mf3'!$B$27:$B$51,MATCH('mf1'!B31,'mf3'!$B$27:$B$51,0),1)","v":{"$error":"#N/A"}},{"$f":"INDEX('mf3'!$B$27:$G$51,MATCH('mf1'!B31,'mf3'!$B$27:$B$51,0),6)","v":{"$error":"#N/A"}},{"$f":"IF(ISERROR(INDEX('mf3'!$B$27:$B$51,MATCH('mf1'!B31,'mf3'!$B$27:$B$51,0),1)),0,1)","v":0},{"$f":"INDEX('mf1'!$B$27:$B$51,MATCH('mf3'!B31,'mf1'!$B$27:$B$51,0),1)","v":"Container Corp."},{"$f":"INDEX('mf1'!$B$27:$G$51,MATCH('mf3'!B31,'mf1'!$B$27:$B$51,0),6)","v":2.84},"GAIL",null,{"$f":"INDEX(mutualfund3s,MATCH(0,COUNTIF($AE$1:AE5,mutualfund3s),0))","v":"HDFC"}]
{"$rows_left_out":56}
{"sheet":"Results-advanced","index":2,"n_rows":55,"n_cols":13,"rows_kept":55,"cut":false,"hidden":false,"merged":[[28,4,28,6]]}
["Common Stocks (% in equity folio)",{"$f":"'Results-simple'!C2","v":"Franklin India Bluechip"},{"$f":"'Results-simple'!B2","v":"IDFC Premier Equity Direct"},null,"Common Stocks (% in equity folio)",{"$f":"'Results-simple'!D2","v":"Quantum Long Term Equity"},{"$f":"'Results-simple'!C2","v":"Franklin India Bluechip"},null,null,null,null,{"$f":"IF(M1=\"\",IF(M2=\"\",IF(M3=\"\",IF(M4=\"\",IF(M5=\"\",IF(M6=\"\",IF(M7=\"\",IF(M8=\"\",IF(M9=\"\",IF(M10=\"\",IF(M11=\"\",IF(M12=\"\",IF(M13=\"\",IF(M14=\"\",IF(M15=\"\",IF(M16=\"\",IF(M17=\"\",IF(M18=\"\",IF(M19=\"\",IF(M20=\"\",IF(M21=\"\",IF(M22=\"\",IF(M23=\"\",IF(M24=\"\",IF(M25=\"\",IF(M26=\"\",M27,M26),M25),M24),M23),M22),M21),M20),M19),M18),M17),M16),M15),M14),M13),M12),M11),M10),M9),M8),M7),M6),M5),M4),M3),M2),M1)","v":0},{"$f":"IF(ISERROR(INDEX($E$2:$E$26,MATCH(A2,$E$2:$E$26,0),1)),\"\",INDEX($E$2:$E$26,MATCH(A2,$E$2:$E$26,0),1))","v":""}]
[{"$f":"INDEX(mutualfund2s,MATCH(0,COUNTIF($A$1:A1,mutualfund2s),0))","v":"Asian Paints"},{"$f":"  IF(ISERROR(A2),\"\",IF(A2=0,\"\",INDEX(mf2port,MATCH(A2,\\,0),2)))","v":1.52},{"$f":"  IF(ISERROR(A2),\"\",IF(A2=0,\"\",INDEX(mf1port,MATCH(A2,'Results-simple'!$M$2:$M$26,0),2)))","v":3.27},null,{"$f":"INDEX(mutualfund3s,MATCH(0,COUNTIF($E$1:E1,mutualfund3s),0))","v":"Infosys"},{"$f":"  IF(ISERROR(E2),\"\",IF(E2=0,\"\",INDEX(mf3port,MATCH(E2,mf3stocks,0),2)))","v":5.05},{"$f":"IF(ISERROR(E2),\"\",IF(E2=0,\"\",INDEX(mf2port2,MATCH(E2,'Results-simple'!$T$2:$T$26,0),2)))","v":9.7899999999999991},null,null,null,{"$f":"INDEX(common3,MATCH(0,COUNTIF($K$1:K1,common3),0))","v":0},{"$f":"IF(M2=\"\",IF(M3=\"\",IF(M4=\"\",IF(M5=\"\",IF(M6=\"\",IF(M7=\"\",IF(M8=\"\",IF(M9=\"\",IF(M10=\"\",IF(M11=\"\",IF(M12=\"\",IF(M13=\"\",IF(M14=\"\",IF(M15=\"\",IF(M16=\"\",IF(M17=\"\",IF(M18=\"\",IF(M19=\"\",IF(M20=\"\",IF(M21=\"\",IF(M22=\"\",IF(M23=\"\",IF(M24=\"\",IF(M25=\"\",IF(M26=\"\",IF(M27=\"\",M28,M27),M26),M25),M24),M23),M22),M21),M20),M19),M18),M17),M16),M15),M14),M13),M12),M11),M10),M9),M8),M7),M6),M5),M4),M3),M2)","v":0},""]
[{"$f":"INDEX(mutualfund2s,MATCH(0,COUNTIF($A$1:A2,mutualfund2s),0))","v":"HDFC Bank"},5.68,{"$f":"  IF(ISERROR(A3),\"\",IF(A3=0,\"\",INDEX(mf1port,MATCH(A3,'Results-simple'!$M$2:$M$26,0),2)))","v":1.93},null,{"$f":"INDEX(mutualfund3s,MATCH(0,COUNTIF($E$1:E2,mutualfund3s),0))","v":"ONGC"},3.62,{"$f":"IF(ISERROR(E3),\"\",IF(E3=0,\"\",INDEX(mf2port2,MATCH(E3,'Results-simple'!$T$2:$T$26,0),2)))","v":2.88},null,null,null,{"$f":"INDEX(common3,MATCH(0,COUNTIF($K$1:K2,common3),0))","v":{"$error":"#N/A"}},0,""]
[{"$f":"INDEX(mutualfund2s,MATCH(0,COUNTIF($A$1:A3,mutualfund2s),0))","v":0},"",{"$f":"  IF(ISERROR(A4),\"\",IF(A4=0,\"\",INDEX(mf1port,MATCH(A4,'Results-simple'!$M$2:$M$26,0),2)))","v":""},null,{"$f":"INDEX(mutualfund3s,MATCH(0,COUNTIF($E$1:E3,mutualfund3s),0))","v":"NTPC"},2.29,{"$f":"IF(ISERROR(E4),\"\",IF(E4=0,\"\",INDEX(mf2port2,MATCH(E4,'Results-simple'!$T$2:$T$26,0),2)))","v":2.8},null,null,null,{"$f":"INDEX(common3,MATCH(0,COUNTIF($K$1:K3,common3),0))","v":{"$error":"#N/A"}},0,""]
[{"$f":"INDEX(mutualfund2s,MATCH(0,COUNTIF($A$1:A4,mutualfund2s),0))","v":{"$error":"#N/A"}},"",{"$f":"  IF(ISERROR(A5),\"\",IF(A5=0,\"\",INDEX(mf1port,MATCH(A5,'Results-simple'!$M$2:$M$26,0),2)))","v":""},null,{"$f":"INDEX(mutualfund3s,MATCH(0,COUNTIF($E$1:E4,mutualfund3s),0))","v":"Larsen & Toubro"},2.31,{"$f":"IF(ISERROR(E5),\"\",IF(E5=0,\"\",INDEX(mf2port2,MATCH(E5,'Results-simple'!$T$2:$T$26,0),2)))","v":2.12},null,null,null,{"$f":"INDEX(common3,MATCH(0,COUNTIF($K$1:K4,common3),0))","v":{"$error":"#N/A"}},0,""]
[{"$f":"INDEX(mutualfund2s,MATCH(0,COUNTIF($A$1:A5,mutualfund2s),0))","v":{"$error":"#N/A"}},"",{"$f":"  IF(ISERROR(A6),\"\",IF(A6=0,\"\",INDEX(mf1port,MATCH(A6,'Results-simple'!$M$2:$M$26,0),2)))","v":""},null,{"$f":"INDEX(mutualfund3s,MATCH(0,COUNTIF($E$1:E5,mutualfund3s),0))","v":"HDFC"},5.61,{"$f":"IF(ISERROR(E6),\"\",IF(E6=0,\"\",INDEX(mf2port2,MATCH(E6,'Results-simple'!$T$2:$T$26,0),2)))","v":2.09},null,null,null,{"$f":"INDEX(common3,MATCH(0,COUNTIF($K$1:K5,common3),0))","v":{"$error":"#N/A"}},0,""]
{"$rows_left_out":50}
{"sheet":"mf1","index":3,"n_rows":51,"n_cols":7,"rows_kept":51,"cut":false,"hidden":false,"merged":[]}
["IDFC Premier Equity Direct"]
[]
[]
["Category:","Equity: Mid & Small Cap"]
["Net Assets:","R 3,448 crore (As on Dec 31, 2013)"]
["Expense:","1.50% (As on Sep 30, 2013)"]
{"$rows_left_out":46}
{"sheet":"mf2","index":4,"n_rows":51,"n_cols":7,"rows_kept":51,"cut":false,"hidden":false,"merged":[]}
["Franklin India Bluechip"]
[]
[]
["Category:","Equity: Large Cap"]
["Net Assets:","R 4,958 crore (As on Dec 31, 2013)"]
["Expense:","2.16% (As on Sep 30, 2013)"]
{"$rows_left_out":46}
{"sheet":"mf3","index":5,"n_rows":51,"n_cols":7,"rows_kept":51,"cut":false,"hidden":false,"merged":[]}
["Quantum Long Term Equity"]
[]
[]
["Category:","Equity: Large & Mid Cap"]
["Net Assets:","R 201 crore (As on Dec 31, 2013)"]
["Expense:","1.25% (As on Sep 30, 2013)"]
{"$rows_left_out":45}