{"text_format":"1","workbook":"xlsx","n_sheets":6,"sheets":["Main","Results-simple","Results-advanced","mf1","mf2","mf3"],"not_rendered":{"charts":1,"images":0,"macros":1,"external_links":0,"defined_names":95,"comments":0,"pivot_tables":0},"unopened":[],"bounds":{"document_bytes":16777216,"sheet_cells":100000,"rows_first":2000,"rows_last":500,"rows_between":2000,"halvings":0,"cell_chars":16384,"cell_head_chars":4096},"cells_cut":0,"cells_raw":0,"read":"whole","date_system":"1900"}

{"sheet":"Main","index":0,"n_rows":750,"n_cols":38,"rows_kept":750,"cut":false,"hidden":false,"merged":[[25,1,25,6],[25,7,25,10],[25,11,27,11],[27,5,27,10],[2,1,2,11],[20,1,20,6],[20,7,20,10],[20,11,22,11],[22,5,22,10],[3,1,3,11],[10,11,12,11],[5,11,7,11],[15,1,15,6],[15,7,15,10],[15,11,17,11],[5,1,5,6],[5,7,5,10],[10,1,10,6],[10,7,10,10],[17,5,17,10],[12,1,12,4],[12,5,12,10],[23,1,23,5],[24,1,24,4],[7,1,7,4],[7,5,7,10],[6,1,6,10],[11,1,11,10],[32,2,32,3],[33,2,33,3],[34,2,34,3],[30,2,30,3],[31,2,31,3],[30,4,30,5],[31,4,31,5],[32,4,32,5],[33,4,33,5],[34,4,34,5]]}
[null,null,null,null,null,null,null,null,null,null,null,null,null,"MF3","MF2","MF1",null,null,null,{"$f":"INDEX(Q2:R750,MATCH(F8,Q2:Q750,0),2)","v":16501},"mf1","wrt cat avg",{"$f":"IF(VALUE(C12)>C16,1,0)","v":0},{"$f":"IF(VALUE(D12)>D16,1,0)","v":0},{"$f":"IF(VALUE(E12)>E16,1,0)","v":0},{"$f":"IF(VALUE(F12)>F16,1,0)","v":0},{"$f":"IF(VALUE(G12)>G16,1,0)","v":0},null,{"$f":"SUM(W1:AA1)","v":0},null,"mf1",{"$f":"COUNTIF(AE2:AE749,\"?*\")","v":2},null,"No",null,"mf2",null,"mf3"]
[null,null,null,null,null,null,null,null,null,null,null,null,null,{"$f":"IF(ISNUMBER(SEARCH($H$16,Q2)),MAX($N$1,N1)+1,0)","v":0},{"$f":"IF(ISNUMBER(SEARCH($H$11,Q2)),MAX($O$1,O1)+1,0)","v":0},{"$f":"IF(ISNUMBER(SEARCH($H$6,Q2)),MAX($P$1,P1)+1,0)","v":0},"Axis Equity",10780,null,{"$f":"INDEX(Q2:R750,MATCH(F13,Q2:Q750,0),2)","v":114},"mf2","wrt sensex",{"$f":"IF(VALUE(C12)>C18,1,0)","v":0},{"$f":"IF(VALUE(D12)>D18,1,0)","v":0},{"$f":"IF(VALUE(E12)>E18,1,0)","v":0},{"$f":"IF(VALUE(F12)>F18,1,0)","v":0},{"$f":"IF(VALUE(G12)>G18,1,0)","v":0},null,{"$f":"SUM(W2:AA2)","v":0},null,{"$f":"IFERROR(VLOOKUP(ROWS($AE$2:AE2),P2:Q750,2,0),\"\")","v":"IDFC Premier Equity Direct"},{"$f":"OFFSET(AE2,,,COUNTIF($AE$2:$AE$749,\"?*\"),)","v":"IDFC Premier Equity Direct"},null,"Yes",null,{"$f":"IFERROR(VLOOKUP(ROWS($AJ$2:AJ2),O2:Q750,3,0),\"\")","v":"Franklin India Bluechip"},null,{"$f":"IFERROR(VLOOKUP(ROWS(AL$2:$AL2),N2:Q750,4,0),\"\")","v":"Quantum Long Term Equity"}]
[null,"Mutual Fund Portfolio Comparison Tool",null,null,null,null,null,null,null,null,null,null,null,{"$f":"IF(ISNUMBER(SEARCH($H$16,Q3)),MAX($N$1,N2)+1,0)","v":0},{"$f":"IF(ISNUMBER(SEARCH($H$11,Q3)),MAX($O$1,O2)+1,0)","v":0},0,"Axis Equity Direct",15682,null,{"$f":"INDEX(Q2:R750,MATCH(F18,Q2:Q750,0),2)","v":3181},"mf3","wrt Nifty",{"$f":"IF(VALUE(C12)>C22,1,0)","v":0},{"$f":"IF(VALUE(D12)>D22,1,0)","v":0},{"$f":"IF(VALUE(E12)>E22,1,0)","v":0},{"$f":"IF(VALUE(F12)>F22,1,0)","v":0},{"$f":"IF(VALUE(G12)>G22,1,0)","v":0},null,{"$f":"SUM(W3:AA3)","v":0},null,{"$f":"IFERROR(VLOOKUP(ROWS($AE$2:AE3),P3:Q751,2,0),\"\")","v":"IDFC Premier Equity Regular"},null,{"$f":"F8","v":"IDFC Premier Equity Direct"},null,null,{"$f":"IFERROR(VLOOKUP(ROWS($AJ$2:AJ3),O3:Q751,3,0),\"\")","v":"Franklin India Bluechip Direct"},null,{"$f":"IFERROR(VLOOKUP(ROWS(AL$2:$AL3),N3:Q751,4,0),\"\")","v":""}]
[null,null,null,null,null,null,null,null,null,null,null,null,null,0,0,0,"Axis Focused 25",14951,null,null,null,null,{"$f":"SUM(W1:W3)","v":0},{"$f":"SUM(X1:X3)","v":0},{"$f":"SUM(Y1:Y3)","v":0},{"$f":"SUM(Z1:Z3)","v":0},{"$f":"SUM(AA1:AA3)","v":0},null,null,null,{"$f":"IFERROR(VLOOKUP(ROWS($AE$2:AE4),P4:Q752,2,0),\"\")","v":""},null,null,null,null,{"$f":"IFERROR(VLOOKUP(ROWS(AJ$2:$AJ4),O4:Q752,3,0),\"\")","v":"Franklin India Flexi Cap"},null,{"$f":"IFERROR(VLOOKUP(ROWS(AL$2:$AL4),N4:Q752,4,0),\"\")","v":""}]
[null,null,null,null,null,null,null,null,null,null,null,null,null,0,0,0,"Axis Focused 25 Direct",15684,null,null,null,null,null,null,null,null,null,null,null,null,{"$f":"IFERROR(VLOOKUP(ROWS($AE$2:AE5),P5:Q753,2,0),\"\")","v":""},null,null,null,null,{"$f":"IFERROR(VLOOKUP(ROWS(AJ$2:$AJ5),O5:Q753,3,0),\"\")","v":"Franklin India Flexi Cap Direct"},null,{"$f":"IFERROR(VLOOKUP(ROWS(AL$2:$AL5),N5:Q753,4,0),\"\")","v":""}]
[null,"Type the first few letters of the MF scheme you need in the green area. ",null,null,null,null,null,"idfc pre",null,null,null,"MF1",null,0,0,0,"Axis Long Term Equity",10826,null,null,null,null,null,null,null,null,null,null,null,null,{"$f":"IFERROR(VLOOKUP(ROWS($AE$2:AE6),P6:Q754,2,0),\"\")","v":""},null,null,null,null,{"$f":"IFERROR(VLOOKUP(ROWS(AJ$2:$AJ6),O6:Q754,3,0),\"\")","v":"Franklin India High Growth Companies"},null,{"$f":"IFERROR(VLOOKUP(ROWS(AL$2:$AL6),N6:Q754,4,0),\"\")","v":""}]
[null,null,null,null,null,null,null,null,null,null,null,null,null,0,0,0,"Axis Long Term Equity Direct",15688,null,null,null,null,null,null,null,null,null,null,null,null,{"$f":"IFERROR(VLOOKUP(ROWS($AE$2:AE7),P7:Q755,2,0),\"\")","v":""},null,null,null,null,{"$f":"IFERROR(VLOOKUP(ROWS(AJ$2:$AJ7),O7:Q755,3,0),\"\")","v":"Franklin India High Growth Companies Direct"},null,{"$f":"IFERROR(VLOOKUP(ROWS(AL$2:$AL7),N7:Q755,4,0),\"\")","v":""}]
[null,"Then select the scheme you need from the drop-down list",null,null,null,"IDFC Premier Equity Direct",null,null,null,null,null,null,null,0,0,0,"Axis Midcap",12052,null,null,null,null,null,null,null,null,null,null,null,null,{"$f":"IFERROR(VLOOKUP(ROWS($AE$2:AE8),P8:Q756,2,0),\"\")","v":""},null,null,null,null,{"$f":"IFERROR(VLOOKUP(ROWS(AJ$2:$AJ8),O8:Q756,3,0),\"\")","v":"Franklin India Index BSE Sensex"},null,{"$f":"IFERROR(VLOOKUP(ROWS(AL$2:$AL8),N8:Q756,4,0),\"\")","v":""}]
[null,null,null,null,null,null,null,null,null,null,null,null,null,0,0,0,"Axis Midcap Direct",15690,null,null,null,null,null,null,null,null,null,null,null,null,{"$f":"IFERROR(VLOOKUP(ROWS($AE$2:AE9),P9:Q757,2,0),\"\")","v":""},null,null,null,null,{"$f":"IFERROR(VLOOKUP(ROWS(AJ$2:$AJ9),O9:Q757,3,0),\"\")","v":"Franklin India Index BSE Sensex Direct"},null,{"$f":"IFERROR(VLOOKUP(ROWS(AL$2:$AL9),N9:Q757,4,0),\"\")","v":""}]
[null,null,null,null,null,null,null,null,null,null,null,null,null,0,0,0,"Baroda Pioneer Banking and Financial Services",14946,null,null,null,null,null,null,null,null,null,null,null,null,{"$f":"IFERROR(VLOOKUP(ROWS($AE$2:AE10),P10:Q758,2,0),\"\")","v":""},null,null,null,null,{"$f":"IFERROR(VLOOKUP(ROWS(AJ$2:$AJ10),O10:Q758,3,0),\"\")","v":"Franklin India Index NSE Nifty"},null,{"$f":"IFERROR(VLOOKUP(ROWS(AL$2:$AL10),N10:Q758,4,0),\"\")","v":""}]
[null,"Type the first few letters of the MF scheme you need in the green area. ",null,null,null,null,null,"franklin india",null,null,null,"MF2",null,0,0,0,"Baroda Pioneer Banking and Financial Services Direct",15698,null,null,null,null,null,null,null,null,null,null,null,null,{"$f":"IFERROR(VLOOKUP(ROWS($AE$2:AE11),P11:Q759,2,0),\"\")","v":""},null,null,null,null,{"$f":"IFERROR(VLOOKUP(ROWS(AJ$2:$AJ11),O11:Q759,3,0),\"\")","v":"Franklin India Index NSE Nifty Direct"},null,{"$f":"IFERROR(VLOOKUP(ROWS(AL$2:$AL11),N11:Q759,4,0),\"\")","v":""}]
[null,null,null,null,null,null,null,null,null,null,null,null,null,0,0,0,"Baroda Pioneer ELSS 96",32,null,null,null,null,null,null,null,null,null,null,null,null,{"$f":"IFERROR(VLOOKUP(ROWS($AE$2:AE12),P12:Q760,2,0),\"\")","v":""},null,null,null,null,{"$f":"IFERROR(VLOOKUP(ROWS(AJ$2:$AJ12),O12:Q760,3,0),\"\")","v":"Franklin India Opportunities"},null,{"$f":"IFERROR(VLOOKUP(ROWS(AL$2:$AL12),N12:Q760,4,0),\"\")","v":""}]
[null,"Then select the scheme you need from the drop-down list",null,null,null,"Franklin India Bluechip",null,null,null,null,null,null,null,0,0,0,"Baroda Pioneer ELSS 96 Direct",17119,null,null,null,null,null,null,null,null,null,null,null,null,{"$f":"IFERROR(VLOOKUP(ROWS($AE$2:AE13),P13:Q761,2,0),\"\")","v":""},null,null,null,null,{"$f":"IFERROR(VLOOKUP(ROWS(AJ$2:$AJ13),O13:Q761,3,0),\"\")","v":"Franklin India Opportunities Direct"},null,{"$f":"IFERROR(VLOOKUP(ROWS(AL$2:$AL13),N13:Q761,4,0),\"\")","v":""}]
[null,null,null,null,null,null,null,null,null,null,null,null,null,0,0,0,"Baroda Pioneer Growth",1820,null,null,null,null,null,null,null,null,null,null,null,null,{"$f":"IFERROR(VLOOKUP(ROWS($AE$2:AE14),P14:Q762,2,0),\"\")","v":""},null,null,null,null,{"$f":"IFERROR(VLOOKUP(ROWS(AJ$2:$AJ14),O14:Q762,3,0),\"\")","v":"Franklin India Prima"},null,{"$f":"IFERROR(VLOOKUP(ROWS(AL$2:$AL14),N14:Q762,4,0),\"\")","v":""}]
[null,null,null,null,null,null,null,null,null,null,null,null,null,0,0,0,"Baroda Pioneer Growth Direct",15707,null,null,null,null,null,null,null,null,null,null,null,null,{"$f":"IFERROR(VLOOKUP(ROWS($AE$2:AE15),P15:Q763,2,0),\"\")","v":""},null,null,null,null,{"$f":"IFERROR(VLOOKUP(ROWS(AJ$2:$AJ15),O15:Q763,3,0),\"\")","v":"Franklin India Prima Direct"},null,{"$f":"IFERROR(VLOOKUP(ROWS(AL$2:$AL15),N15:Q763,4,0),\"\")","v":""}]
[null,"Type the first few letters of the MF scheme you need in the green area. ",null,null,null,null,null,"quantum long",null,null,null,"MF3",null,0,0,0,"Baroda Pioneer Infrastructure",11194,null,null,null,null,null,null,null,null,null,null,null,null,{"$f":"IFERROR(VLOOKUP(ROWS($AE$2:AE16),P16:Q764,2,0),\"\")","v":""},null,null,null,null,{"$f":"IFERROR(VLOOKUP(ROWS(AJ$2:$AJ16),O16:Q764,3,0),\"\")","v":"Franklin India Prima Plus"},null,{"$f":"IFERROR(VLOOKUP(ROWS(AL$2:$AL16),N16:Q764,4,0),\"\")","v":""}]
[null,null,null,null,null,null,null,null,null,null,null,null,null,0,0,0,"Baroda Pioneer Infrastructure Direct",15766,null,null,null,null,null,null,null,null,null,null,null,null,{"$f":"IFERROR(VLOOKUP(ROWS($AE$2:AE17),P17:Q765,2,0),\"\")","v":""},null,null,null,null,{"$f":"IFERROR(VLOOKUP(ROWS(AJ$2:$AJ17),O17:Q765,3,0),\"\")","v":"Franklin India Prima Plus Direct"},null,{"$f":"IFERROR(VLOOKUP(ROWS(AL$2:$AL17),N17:Q765,4,0),\"\")","v":""}]
[null,"Then select the scheme you need from the drop-down list",null,null,null,"Quantum Long Term Equity",null,null,null,null,null,null,null,0,0,0,"Baroda Pioneer PSU Equity",11534,null,null,null,null,null,null,null,null,null,null,null,null,{"$f":"IFERROR(VLOOKUP(ROWS($AE$2:AE18),P18:Q766,2,0),\"\")","v":""},null,null,null,null,{"$f":"IFERROR(VLOOKUP(ROWS(AJ$2:$AJ18),O18:Q766,3,0),\"\")","v":"Franklin India Smaller Companies"},null,{"$f":"IFERROR(VLOOKUP(ROWS(AL$2:$AL18),N18:Q766,4,0),\"\")","v":""}]
[null,null,null,null,null,null,null,null,null,null,null,null,null,0,0,0,"Baroda Pioneer PSU Equity Direct",15783,null,null,null,null,null,null,null,null,null,null,null,null,{"$f":"IFERROR(VLOOKUP(ROWS($AE$2:AE19),P19:Q767,2,0),\"\")","v":""},null,null,null,null,{"$f":"IFERROR(VLOOKUP(ROWS(AJ$2:$AJ19),O19:Q767,3,0),\"\")","v":"Franklin India Smaller Companies Direct"},null,{"$f":"IFERROR(VLOOKUP(ROWS(AL$2:$AL19),N19:Q767,4,0),\"\")","v":""}]
[null,null,null,null,null,null,null,null,null,null,null,null,null,0,0,0,"Birla Sun Life Advantage",27,null,null,null,null,null,null,null,null,null,null,null,null,{"$f":"IFERROR(VLOOKUP(ROWS($AE$2:AE20),P20:Q768,2,0),\"\")","v":""},null,null,null,null,{"$f":"IFERROR(VLOOKUP(ROWS(AJ$2:$AJ20),O20:Q768,3,0),\"\")","v":"Franklin India Taxshield"},null,{"$f":"IFERROR(VLOOKUP(ROWS(AL$2:$AL20),N20:Q768,4,0),\"\")","v":""}]
[null,null,null,null,null,null,null,null,null,null,null,null,null,0,0,0,"Birla Sun Life Advantage Direct",15697,null,null,null,null,null,null,null,null,null,null,null,null,{"$f":"IFERROR(VLOOKUP(ROWS($AE$2:AE21),P21:Q769,2,0),\"\")","v":""},null,null,null,null,{"$f":"IFERROR(VLOOKUP(ROWS(AJ$2:$AJ21),O21:Q769,3,0),\"\")","v":"Franklin India Taxshield Direct"},null,{"$f":"IFERROR(VLOOKUP(ROWS(AL$2:$AL21),N21:Q769,4,0),\"\")","v":""}]
[null,"Click to view MF1 Fund Page at VR Online",null,null,null,null,null,null,null,null,null,null,null,0,0,0,"Birla Sun Life Asset Allocation Aggressive",2049,null,null,null,null,null,null,null,null,null,null,null,null,{"$f":"IFERROR(VLOOKUP(ROWS($AE$2:AE22),P22:Q770,2,0),\"\")","v":""},null,null,null,null,{"$f":"IFERROR(VLOOKUP(ROWS(AJ$2:$AJ22),O22:Q770,3,0),\"\")","v":""},null,{"$f":"IFERROR(VLOOKUP(ROWS(AL$2:$AL22),N22:Q770,4,0),\"\")","v":""}]
[null,null,null,null,null,null,null,null,null,null,null,null,null,0,0,0,"Birla Sun Life Asset Allocation Aggressive Direct",15704,null,null,null,null,null,null,null,null,null,null,null,null,{"$f":"IFERROR(VLOOKUP(ROWS($AE$2:AE23),P23:Q771,2,0),\"\")","v":""},null,null,null,null,{"$f":"IFERROR(VLOOKUP(ROWS(AJ$2:$AJ23),O23:Q771,3,0),\"\")","v":""},null,{"$f":"IFERROR(VLOOKUP(ROWS(AL$2:$AL23),N23:Q771,4,0),\"\")","v":""}]
[null,"Click to view MF2 Fund Page at VR Online",null,null,null,null,null,null,null,null,null,null,null,0,0,0,"Birla Sun Life Buy India",726,null,null,null,null,null,null,null,null,null,null,null,null,{"$f":"IFERROR(VLOOKUP(ROWS($AE$2:AE24),P24:Q772,2,0),\"\")","v":""},null,null,null,null,{"$f":"IFERROR(VLOOKUP(ROWS(AJ$2:$AJ24),O24:Q772,3,0),\"\")","v":""},null,{"$f":"IFERROR(VLOOKUP(ROWS(AL$2:$AL24),N24:Q772,4,0),\"\")","v":""}]
[null,null,null,null,null,null,null,null,null,null,null,null,null,0,0,0,"Birla Sun Life Buy India Direct",15881,null,null,null,null,null,null,null,null,null,null,null,null,{"$f":"IFERROR(VLOOKUP(ROWS($AE$2:AE25),P25:Q773,2,0),\"\")","v":""},null,null,null,null,{"$f":"IFERROR(VLOOKUP(ROWS(AJ$2:$AJ25),O25:Q773,3,0),\"\")","v":""},null,{"$f":"IFERROR(VLOOKUP(ROWS(AL$2:$AL25),N25:Q773,4,0),\"\")","v":""}]
[null,"Click to view MF3 Fund Page at VR Online",null,null,null,null,null,null,null,null,null,null,null,0,0,0,"Birla Sun Life Commodity Equities - Global Agri",9316,null,null,null,null,null,null,null,null,null,null,null,null,{"$f":"IFERROR(VLOOKUP(ROWS($AE$2:AE26),P26:Q774,2,0),\"\")","v":""},null,null,null,null,{"$f":"IFERROR(VLOOKUP(ROWS(AJ$2:$AJ26),O26:Q774,3,0),\"\")","v":""},null,{"$f":"IFERROR(VLOOKUP(ROWS(AL$2:$AL26),N26:Q774,4,0),\"\")","v":""}]
[null,null,null,null,null,null,null,null,null,null,null,null,null,0,0,0,"Birla Sun Life Commodity Equities - Global Agri Direct",15805,null,null,null,null,null,null,null,null,null,null,null,null,{"$f":"IFERROR(VLOOKUP(ROWS($AE$2:AE27),P27:Q775,2,0),\"\")","v":""},null,null,null,null,{"$f":"IFERROR(VLOOKUP(ROWS(AJ$2:$AJ27),O27:Q775,3,0),\"\")","v":""},null,{"$f":"IFERROR(VLOOKUP(ROWS(AL$2:$AL27),N27:Q775,4,0),\"\")","v":""}]
[null,null,null,null,null,null,null,null,null,null,null,null,null,0,0,0,"Birla Sun Life Dividend Yield Plus",1530,null,null,null,null,null,null,null,null,null,null,null,null,{"$f":"IFERROR(VLOOKUP(ROWS($AE$2:AE28),P28:Q776,2,0),\"\")","v":""},null,null,null,null,{"$f":"IFERROR(VLOOKUP(ROWS(AJ$2:$AJ28),O28:Q776,3,0),\"\")","v":""},null,{"$f":"IFERROR(VLOOKUP(ROWS(AL$2:$AL28),N28:Q776,4,0),\"\")","v":""}]
[null,null,null,null,null,null,null,null,null,null,null,null,null,0,0,0,"Birla Sun Life Dividend Yield Plus Direct",15813,null,null,null,null,null,null,null,null,null,null,null,null,{"$f":"IFERROR(VLOOKUP(ROWS($AE$2:AE29),P29:Q777,2,0),\"\")","v":""},null,null,null,null,{"$f":"IFERROR(VLOOKUP(ROWS(AJ$2:$AJ29),O29:Q777,3,0),\"\")","v":""},null,{"$f":"IFERROR(VLOOKUP(ROWS(AL$2:$AL29),N29:Q777,4,0),\"\")","v":""}]
[null,null,null,null,null,null,null,null,null,null,null,null,null,0,0,0,"Birla Sun Life Equity",561,null,null,null,null,null,null,null,null,null,null,null,null,{"$f":"IFERROR(VLOOKUP(ROWS($AE$2:AE30),P30:Q778,2,0),\"\")","v":""},null,null,null,null,{"$f":"IFERROR(VLOOKUP(ROWS(AJ$2:$AJ30),O30:Q778,3,0),\"\")","v":""},null,{"$f":"IFERROR(VLOOKUP(ROWS(AL$2:$AL30),N30:Q778,4,0),\"\")","v":""}]
[null,null,null,null,null,null,null,null,null,null,null,null,null,0,0,0,"Birla Sun Life Equity Direct",15741,null,null,null,null,null,null,null,null,null,null,null,null,{"$f":"IFERROR(VLOOKUP(ROWS($AE$2:AE31),P31:Q779,2,0),\"\")","v":""},null,null,null,null,{"$f":"IFERROR(VLOOKUP(ROWS(AJ$2:$AJ31),O31:Q779,3,0),\"\")","v":""},null,{"$f":"IFERROR(VLOOKUP(ROWS(AL$2:$AL31),N31:Q779,4,0),\"\")","v":""}]
[null,null,null,null,null,null,null,null,null,null,null,null,null,0,0,0,"Birla Sun Life Frontline Equity",1400,null,null,null,null,null,null,null,null,null,null,null,null,{"$f":"IFERROR(VLOOKUP(ROWS($AE$2:AE32),P32:Q780,2,0),\"\")","v":""},null,null,null,null,{"$f":"IFERROR(VLOOKUP(ROWS(AJ$2:$AJ32),O32:Q780,3,0),\"\")","v":""},null,{"$f":"IFERROR(VLOOKUP(ROWS(AL$2:$AL32),N32:Q780,4,0),\"\")","v":""}]
[null,null,null,null,null,null,null,null,null,null,null,null,null,0,0,0,"Birla Sun Life Frontline Equity Direct",15831,null,null,null,null,null,null,null,null,null,null,null,null,{"$f":"IFERROR(VLOOKUP(ROWS($AE$2:AE33),P33:Q781,2,0),\"\")","v":""},null,null,null,null,{"$f":"IFERROR(VLOOKUP(ROWS(AJ$2:$AJ33),O33:Q781,3,0),\"\")","v":""},null,{"$f":"IFERROR(VLOOKUP(ROWS(AL$2:$AL33),N33:Q781,4,0),\"\")","v":""}]
[null,null,null,null,null,null,null,null,null,null,null,null,null,0,0,0,"Birla Sun Life Index",1445,null,null,null,null,null,null,null,null,null,null,null,null,{"$f":"IFERROR(VLOOKUP(ROWS($AE$2:AE34),P34:Q782,2,0),\"\")","v":""},null,null,null,null,{"$f":"IFERROR(VLOOKUP(ROWS(AJ$2:$AJ34),O34:Q782,3,0),\"\")","v":""},null,{"$f":"IFERROR(VLOOKUP(ROWS(AL$2:$AL34),N34:Q782,4,0),\"\")","v":""}]
[null,null,null,null,null,null,null,null,null,null,null,null,null,0,0,0,"Birla Sun Life Index Direct",15769,null,null,null,null,null,null,null,null,null,null,null,null,{"$f":"IFERROR(VLOOKUP(ROWS($AE$2:AE35),P35:Q783,2,0),\"\")","v":""},null,null,null,null,{"$f":"IFERROR(VLOOKUP(ROWS(AJ$2:$AJ35),O35:Q783,3,0),\"\")","v":""},null,{"$f":"IFERROR(VLOOKUP(ROWS(AL$2:$AL35),N35:Q783,4,0),\"\")","v":""}]
[null,null,null,null,null,null,null,null,null,null,null,null,null,0,0,0,"Birla Sun Life India GenNext",2787,null,null,null,null,null,null,null,null,null,null,null,null,{"$f":"IFERROR(VLOOKUP(ROWS($AE$2:AE36),P36:Q784,2,0),\"\")","v":""},null,null,null,null,{"$f":"IFERROR(VLOOKUP(ROWS(AJ$2:$AJ36),O36:Q784,3,0),\"\")","v":""},null,{"$f":"IFERROR(VLOOKUP(ROWS(AL$2:$AL36),N36:Q784,4,0),\"\")","v":""}]
[null,null,null,null,null,null,null,null,null,null,null,null,null,0,0,0,"Birla Sun Life India GenNext Direct",15834,null,null,null,null,null,null,null,null,null,null,null,null,{"$f":"IFERROR(VLOOKUP(ROWS($AE$2:AE37),P37:Q785,2,0),\"\")","v":""},null,null,null,null,{"$f":"IFERROR(VLOOKUP(ROWS(AJ$2:$AJ37),O37:Q785,3,0),\"\")","v":""},null,{"$f":"IFERROR(VLOOKUP(ROWS(AL$2:$AL37),N37:Q785,4,0),\"\")","v":""}]
[null,null,null,null,null,null,null,null,null,null,null,null,null,0,0,0,"Birla Sun Life India Opportunities",1824,null,null,null,null,null,null,null,null,null,null,null,null,{"$f":"IFERROR(VLOOKUP(ROWS($AE$2:AE38),P38:Q786,2,0),\"\")","v":""},null,null,null,null,{"$f":"IFERROR(VLOOKUP(ROWS(AJ$2:$AJ38),O38:Q786,3,0),\"\")","v":""},null,{"$f":"IFERROR(VLOOKUP(ROWS(AL$2:$AL38),N38:Q786,4,0),\"\")","v":""}]
[null,null,null,null,null,null,null,null,null,null,null,null,null,0,0,0,"Birla Sun Life India Opportunities Direct",15901,null,null,null,null,null,null,null,null,null,null,null,null,{"$f":"IFERROR(VLOOKUP(ROWS($AE$2:AE39),P39:Q787,2,0),\"\")","v":""},null,null,null,null,{"$f":"IFERROR(VLOOKUP(ROWS(AJ$2:$AJ39),O39:Q787,3,0),\"\")","v":""},null,{"$f":"IFERROR(VLOOKUP(ROWS(AL$2:$AL39),N39:Q787,4,0),\"\")","v":""}]
[null,null,null,null,null,null,null,null,null,null,null,null,null,0,0,0,"Birla Sun Life India Reforms",11196,null,null,null,null,null,null,null,null,null,null,null,null,{"$f":"IFERROR(VLOOKUP(ROWS($AE$2:AE40),P40:Q788,2,0),\"\")","v":""},null,null,null,null,{"$f":"IFERROR(VLOOKUP(ROWS(AJ$2:$AJ40),O40:Q788,3,0),\"\")","v":""},null,{"$f":"IFERROR(VLOOKUP(ROWS(AL$2:$AL40),N40:Q788,4,0),\"\")","v":""}]
[null,null,null,null,null,null,null,null,null,null,null,null,null,0,0,0,"Birla Sun Life India Reforms Direct",15837,null,null,null,null,null,null,null,null,null,null,null,null,{"$f":"IFERROR(VLOOKUP(ROWS($AE$2:AE41),P41:Q789,2,0),\"\")","v":""},null,null,null,null,{"$f":"IFERROR(VLOOKUP(ROWS(AJ$2:$AJ41),O41:Q789,3,0),\"\")","v":""},null,{"$f":"IFERROR(VLOOKUP(ROWS(AL$2:$AL41),N41:Q789,4,0),\"\")","v":""}]
[null,null,null,null,null,null,null,null,null,null,null,null,null,0,0,0,"Birla Sun Life Infrastructure",3161,null,null,null,null,null,null,null,null,null,null,null,null,{"$f":"IFERROR(VLOOKUP(ROWS($AE$2:AE42),P42:Q790,2,0),\"\")","v":""},null,null,null,null,{"$f":"IFERROR(VLOOKUP(ROWS(AJ$2:$AJ42),O42:Q790,3,0),\"\")","v":""},null,{"$f":"IFERROR(VLOOKUP(ROWS(AL$2:$AL42),N42:Q790,4,0),\"\")","v":""}]
[null,null,null,null,null,null,null,null,null,null,null,null,null,0,0,0,"Birla Sun Life Infrastructure Direct",15846,null,null,null,null,null,null,null,null,null,null,null,null,{"$f":"IFERROR(VLOOKUP(ROWS($AE$2:AE43),P43:Q791,2,0),\"\")","v":""},null,null,null,null,{"$f":"IFERROR(VLOOKUP(ROWS(AJ$2:$AJ43),O43:Q791,3,0),\"\")","v":""},null,{"$f":"IFERROR(VLOOKUP(ROWS(AL$2:$AL43),N43:Q791,4,0),\"\")","v":""}]
[null,null,null,null,null,null,null,null,null,null,null,null,null,0,0,0,"Birla Sun Life International Equity Plan A",5802,null,null,null,null,null,null,null,null,null,null,null,null,{"$f":"IFERROR(VLOOKUP(ROWS($AE$2:AE44),P44:Q792,2,0),\"\")","v":""},null,null,null,null,{"$f":"IFERROR(VLOOKUP(ROWS(AJ$2:$AJ44),O44:Q792,3,0),\"\")","v":""},null,{"$f":"IFERROR(VLOOKUP(ROWS(AL$2:$AL44),N44:Q792,4,0),\"\")","v":""}]
[null,null,null,null,null,null,null,null,null,null,null,null,null,0,0,0,"Birla Sun Life International Equity Plan A Direct",15903,null,null,null,null,null,null,null,null,null,null,null,null,{"$f":"IFERROR(VLOOKUP(ROWS($AE$2:AE45),P45:Q793,2,0),\"\")","v":""},null,null,null,null,{"$f":"IFERROR(VLOOKUP(ROWS(AJ$2:$AJ45),O45:Q793,3,0),\"\")","v":""},null,{"$f":"IFERROR(VLOOKUP(ROWS(AL$2:$AL45),N45:Q793,4,0),\"\")","v":""}]
[null,null,null,null,null,null,null,null,null,null,null,null,null,0,0,0,"Birla Sun Life International Equity Plan B",5804,null,null,null,null,null,null,null,null,null,null,null,null,{"$f":"IFERROR(VLOOKUP(ROWS($AE$2:AE46),P46:Q794,2,0),\"\")","v":""},null,null,null,null,{"$f":"IFERROR(VLOOKUP(ROWS(AJ$2:$AJ46),O46:Q794,3,0),\"\")","v":""},null,{"$f":"IFERROR(VLOOKUP(ROWS(AL$2:$AL46),N46:Q794,4,0),\"\")","v":""}]
[null,null,null,null,null,null,null,null,null,null,null,null,null,0,0,0,"Birla Sun Life International Equity Plan B Direct",15905,null,null,null,null,null,null,null,null,null,null,null,null,{"$f":"IFERROR(VLOOKUP(ROWS($AE$2:AE47),P47:Q795,2,0),\"\")","v":""},null,null,null,null,{"$f":"IFERROR(VLOOKUP(ROWS(AJ$2:$AJ47),O47:Q795,3,0),\"\")","v":""},null,{"$f":"IFERROR(VLOOKUP(ROWS(AL$2:$AL47),N47:Q795,4,0),\"\")","v":""}]
[null,null,null,null,null,null,null,null,null,null,null,null,null,0,0,0,"Birla Sun Life Long Term Advantage",3590,null,null,null,null,null,null,null,null,null,null,null,null,{"$f":"IFERROR(VLOOKUP(ROWS($AE$2:AE48),P48:Q796,2,0),\"\")","v":""},null,null,null,null,{"$f":"IFERROR(VLOOKUP(ROWS(AJ$2:$AJ48),O48:Q796,3,0),\"\")","v":""},null,{"$f":"IFERROR(VLOOKUP(ROWS(AL$2:$AL48),N48:Q796,4,0),\"\")","v":""}]
[null,null,null,null,null,null,null,null,null,null,null,null,null,0,0,0,"Birla Sun Life Long Term Advantage Direct",15908,null,null,null,null,null,null,null,null,null,null,null,null,{"$f":"IFERROR(VLOOKUP(ROWS($AE$2:AE49),P49:Q797,2,0),\"\")","v":""},null,null,null,null,{"$f":"IFERROR(VLOOKUP(ROWS(AJ$2:$AJ49),O49:Q797,3,0),\"\")","v":""},null,{"$f":"IFERROR(VLOOKUP(ROWS(AL$2:$AL49),N49:Q797,4,0),\"\")","v":""}]
[null,null,null,null,null,null,null,null,null,null,null,null,null,0,0,0,"Birla Sun Life Mid Cap",1439,null,null,null,null,null,null,null,null,null,null,null,null,{"$f":"IFERROR(VLOOKUP(ROWS($AE$2:AE50),P50:Q798,2,0),\"\")","v":""},null,null,null,null,{"$f":"IFERROR(VLOOKUP(ROWS(AJ$2:$AJ50),O50:Q798,3,0),\"\")","v":""},null,{"$f":"IFERROR(VLOOKUP(ROWS(AL$2:$AL50),N50:Q798,4,0),\"\")","v":""}]
[null,null,null,null,null,null,null,null,null,null,null,null,null,0,0,0,"Birla Sun Life Mid Cap Direct",15870,null,null,null,null,null,null,null,null,null,null,null,null,{"$f":"IFERROR(VLOOKUP(ROWS($AE$2:AE51),P51:Q799,2,0),\"\")","v":""},null,null,null,null,{"$f":"IFERROR(VLOOKUP(ROWS(AJ$2:$AJ51),O51:Q799,3,0),\"\")","v":""},null,{"$f":"IFERROR(VLOOKUP(ROWS(AL$2:$AL51),N51:Q799,4,0),\"\")","v":""}]
[null,null,null,null,null,null,null,null,null,null,null,null,null,0,0,0,"Birla Sun Life MNC",787,null,null,null,null,null,null,null,null,null,null,null,null,{"$f":"IFERROR(VLOOKUP(ROWS($AE$2:AE52),P52:Q800,2,0),\"\")","v":""},null,null,null,null,{"$f":"IFERROR(VLOOKUP(ROWS(AJ$2:$AJ52),O52:Q800,3,0),\"\")","v":""},null,{"$f":"IFERROR(VLOOKUP(ROWS(AL$2:$AL52),N52:Q800,4,0),\"\")","v":""}]
[null,null,null,null,null,null,null,null,null,null,null,null,null,0,0,0,"Birla Sun Life MNC Direct",15872,null,null,null,null,null,null,null,null,null,null,null,null,{"$f":"IFERROR(VLOOKUP(ROWS($AE$2:AE53),P53:Q801,2,0),\"\")","v":""},null,null,null,null,{"$f":"IFERROR(VLOOKUP(ROWS(AJ$2:$AJ53),O53:Q801,3,0),\"\")","v":""},null,{"$f":"IFERROR(VLOOKUP(ROWS(AL$2:$AL53),N53:Q801,4,0),\"\")","v":""}]
[null,null,null,null,null,null,null,null,null,null,null,null,null,0,0,0,"Birla Sun Life New Millennium",727,null,null,null,null,null,null,null,null,null,null,null,null,{"$f":"IFERROR(VLOOKUP(ROWS($AE$2:AE54),P54:Q802,2,0),\"\")","v":""},null,null,null,null,{"$f":"IFERROR(VLOOKUP(ROWS(AJ$2:$AJ54),O54:Q802,3,0),\"\")","v":""},null,{"$f":"IFERROR(VLOOKUP(ROWS(AL$2:$AL54),N54:Q802,4,0),\"\")","v":""}]
[null,null,null,null,null,null,null,null,null,null,null,null,null,0,0,0,"Birla Sun Life New Millennium Direct",15878,null,null,null,null,null,null,null,null,null,null,null,null,{"$f":"IFERROR(VLOOKUP(ROWS($AE$2:AE55),P55:Q803,2,0),\"\")","v":""},null,null,null,null,{"$f":"IFERROR(VLOOKUP(ROWS(AJ$2:$AJ55),O55:Q803,3,0),\"\")","v":""},null,{"$f":"IFERROR(VLOOKUP(ROWS(AL$2:$AL55),N55:Q803,4,0),\"\")","v":""}]
[null,null,null,null,null,null,null,null,null,null,null,null,null,0,0,0,"Birla Sun Life Nifty ETF",13012,null,null,null,null,null,null,null,null,null,null,null,null,{"$f":"IFERROR(VLOOKUP(ROWS($AE$2:AE56),P56:Q804,2,0),\"\")","v":""},null,null,null,null,{"$f":"IFERROR(VLOOKUP(ROWS(AJ$2:$AJ56),O56:Q804,3,0),\"\")","v":""},null,{"$f":"IFERROR(VLOOKUP(ROWS(AL$2:$AL56),N56:Q804,4,0),\"\")","v":""}]
[null,null,null,null,null,null,null,null,null,null,null,null,null,0,0,0,"Birla Sun Life Pure Value",6778,null,null,null,null,null,null,null,null,null,null,null,null,{"$f":"IFERROR(VLOOKUP(ROWS($AE$2:AE57),P57:Q805,2,0),\"\")","v":""},null,null,null,null,{"$f":"IFERROR(VLOOKUP(ROWS(AJ$2:$AJ57),O57:Q805,3,0),\"\")","v":""},null,{"$f":"IFERROR(VLOOKUP(ROWS(AL$2:$AL57),N57:Q805,4,0),\"\")","v":""}]
[null,null,null,null,null,null,null,null,null,null,null,null,null,0,0,0,"Birla Sun Life Pure Value Direct",15879,null,null,null,null,null,null,null,null,null,null,null,null,{"$f":"IFERROR(VLOOKUP(ROWS($AE$2:AE58),P58:Q806,2,0),\"\")","v":""},null,null,null,null,{"$f":"IFERROR(VLOOKUP(ROWS(AJ$2:$AJ58),O58:Q806,3,0),\"\")","v":""},null,{"$f":"IFERROR(VLOOKUP(ROWS(AL$2:$AL58),N58:Q806,4,0),\"\")","v":""}]
[null,null,null,null,null,null,null,null,null,null,null,null,null,0,0,0,"Birla Sun Life Small & Midcap",5006,null,null,null,null,null,null,null,null,null,null,null,null,{"$f":"IFERROR(VLOOKUP(ROWS($AE$2:AE59),P59:Q807,2,0),\"\")","v":""},null,null,null,null,{"$f":"IFERROR(VLOOKUP(ROWS(AJ$2:$AJ59),O59:Q807,3,0),\"\")","v":""},null,{"$f":"IFERROR(VLOOKUP(ROWS(AL$2:$AL59),N59:Q807,4,0),\"\")","v":""}]
[null,null,null,null,null,null,null,null,null,null,null,null,null,0,0,0,"Birla Sun Life Small & Midcap Direct",15935,null,null,null,null,null,null,null,null,null,null,null,null,{"$f":"IFERROR(VLOOKUP(ROWS($AE$2:AE60),P60:Q808,2,0),\"\")","v":""},null,null,null,null,{"$f":"IFERROR(VLOOKUP(ROWS(AJ$2:$AJ60),O60:Q808,3,0),\"\")","v":""},null,{"$f":"IFERROR(VLOOKUP(ROWS(AL$2:$AL60),N60:Q808,4,0),\"\")","v":""}]
[null,null,null,null,null,null,null,null,null,null,null,null,null,0,0,0,"Birla Sun Life Special Situations",6550,null,null,null,null,null,null,null,null,null,null,null,null,{"$f":"IFERROR(VLOOKUP(ROWS($AE$2:AE61),P61:Q809,2,0),\"\")","v":""},null,null,null,null,{"$f":"IFERROR(VLOOKUP(ROWS(AJ$2:$AJ61),O61:Q809,3,0),\"\")","v":""},null,{"$f":"IFERROR(VLOOKUP(ROWS(AL$2:$AL61),N61:Q809,4,0),\"\")","v":""}]
[null,null,null,null,null,null,null,null,null,null,null,null,null,0,0,0,"Birla Sun Life Special Situations Direct",15892,null,null,null,null,null,null,null,null,null,null,null,null,{"$f":"IFERROR(VLOOKUP(ROWS($AE$2:AE62),P62:Q810,2,0),\"\")","v":""},null,null,null,null,{"$f":"IFERROR(VLOOKUP(ROWS(AJ$2:$AJ62),O62:Q810,3,0),\"\")","v":""},null,{"$f":"IFERROR(VLOOKUP(ROWS(AL$2:$AL62),N62:Q810,4,0),\"\")","v":""}]
[null,null,null,null,null,null,null,null,null,null,null,null,null,0,0,0,"Birla Sun Life Tax Plan",590,null,null,null,null,null,null,null,null,null,null,null,null,{"$f":"IFERROR(VLOOKUP(ROWS($AE$2:AE63),P63:Q811,2,0),\"\")","v":""},null,null,null,null,{"$f":"IFERROR(VLOOKUP(ROWS(AJ$2:$AJ63),O63:Q811,3,0),\"\")","v":""},null,{"$f":"IFERROR(VLOOKUP(ROWS(AL$2:$AL63),N63:Q811,4,0),\"\")","v":""}]
[null,null,null,null,null,null,null,null,null,null,null,null,null,0,0,0,"Birla Sun Life Tax Plan Direct",15886,null,null,null,null,null,null,null,null,null,null,null,null,{"$f":"IFERROR(VLOOKUP(ROWS($AE$2:AE64),P64:Q812,2,0),\"\")","v":""},null,null,null,null,{"$f":"IFERROR(VLOOKUP(ROWS(AJ$2:$AJ64),O64:Q812,3,0),\"\")","v":""},null,{"$f":"IFERROR(VLOOKUP(ROWS(AL$2:$AL64),N64:Q812,4,0),\"\")","v":""}]
[null,null,null,null,null,null,null,null,null,null,null,null,null,0,0,0,"Birla Sun Life Tax Relief 96",24,null,null,null,null,null,null,null,null,null,null,null,null,{"$f":"IFERROR(VLOOKUP(ROWS($AE$2:AE65),P65:Q813,2,0),\"\")","v":""},null,null,null,null,{"$f":"IFERROR(VLOOKUP(ROWS(AJ$2:$AJ65),O65:Q813,3,0),\"\")","v":""},null,{"$f":"IFERROR(VLOOKUP(ROWS(AL$2:$AL65),N65:Q813,4,0),\"\")","v":""}]
[null,null,null,null,null,null,null,null,null,null,null,null,null,0,0,{"$f":"IF(ISNUMBER(SEARCH($H$6,Q66)),MAX($P$1,P65)+1,0)","v":0},"Birla Sun Life Tax Relief 96 Direct",15889,null,null,null,null,null,null,null,null,null,null,null,null,{"$f":"IFERROR(VLOOKUP(ROWS($AE$2:AE66),P66:Q814,2,0),\"\")","v":""},null,null,null,null,{"$f":"IFERROR(VLOOKUP(ROWS(AJ$2:$AJ66),O66:Q814,3,0),\"\")","v":""},null,{"$f":"IFERROR(VLOOKUP(ROWS(AL$2:$AL66),N66:Q814,4,0),\"\")","v":""}]
[null,null,null,null,null,null,null,null,null,null,null,null,null,{"$f":"IF(ISNUMBER(SEARCH($H$16,Q67)),MAX($N$1,N66)+1,0)","v":0},{"$f":"IF(ISNUMBER(SEARCH($H$11,Q67)),MAX($O$1,O66)+1,0)","v":0},0,"Birla Sun Life Top 100",2865,null,null,null,null,null,null,null,null,null,null,null,null,{"$f":"IFERROR(VLOOKUP(ROWS($AE$2:AE67),P67:Q815,2,0),\"\")","v":""},null,null,null,null,{"$f":"IFERROR(VLOOKUP(ROWS(AJ$2:$AJ67),O67:Q815,3,0),\"\")","v":""},null,{"$f":"IFERROR(VLOOKUP(ROWS(AL$2:$AL67),N67:Q815,4,0),\"\")","v":""}]
[null,null,null,null,null,null,null,null,null,null,null,null,null,0,0,0,"Birla Sun Life Top 100 Direct",15883,null,null,null,null,null,null,null,null,null,null,null,null,{"$f":"IFERROR(VLOOKUP(ROWS($AE$2:AE68),P68:Q816,2,0),\"\")","v":""},null,null,null,null,{"$f":"IFERROR(VLOOKUP(ROWS(AJ$2:$AJ68),O68:Q816,3,0),\"\")","v":""},null,{"$f":"IFERROR(VLOOKUP(ROWS(AL$2:$AL68),N68:Q816,4,0),\"\")","v":""}]
[null,null,null,null,null,null,null,null,null,null,null,null,null,0,0,0,"BNP Paribas Dividend Yield",2830,null,null,null,null,null,null,null,null,null,null,null,null,{"$f":"IFERROR(VLOOKUP(ROWS($AE$2:AE69),P69:Q817,2,0),\"\")","v":""},null,null,null,null,{"$f":"IFERROR(VLOOKUP(ROWS(AJ$2:$AJ69),O69:Q817,3,0),\"\")","v":""},null,{"$f":"IFERROR(VLOOKUP(ROWS(AL$2:$AL69),N69:Q817,4,0),\"\")","v":""}]
[null,null,null,null,null,null,null,null,null,null,null,null,null,0,0,0,"BNP Paribas Dividend Yield Direct",15716,null,null,null,null,null,null,null,null,null,null,null,null,{"$f":"IFERROR(VLOOKUP(ROWS($AE$2:AE70),P70:Q818,2,0),\"\")","v":""},null,null,null,null,{"$f":"IFERROR(VLOOKUP(ROWS(AJ$2:$AJ70),O70:Q818,3,0),\"\")","v":""},null,{"$f":"IFERROR(VLOOKUP(ROWS(AL$2:$AL70),N70:Q818,4,0),\"\")","v":""}]
[null,null,null,null,null,null,null,null,null,null,null,null,null,0,0,0,"BNP Paribas Equity",2338,null,null,null,null,null,null,null,null,null,null,null,null,{"$f":"IFERROR(VLOOKUP(ROWS($AE$2:AE71),P71:Q819,2,0),\"\")","v":""},null,null,null,null,{"$f":"IFERROR(VLOOKUP(ROWS(AJ$2:$AJ71),O71:Q819,3,0),\"\")","v":""},null,{"$f":"IFERROR(VLOOKUP(ROWS(AL$2:$AL71),N71:Q819,4,0),\"\")","v":""}]
[null,null,null,null,null,null,null,null,null,null,null,null,null,0,0,0,"BNP Paribas Equity Direct",15719,null,null,null,null,null,null,null,null,null,null,null,null,{"$f":"IFERROR(VLOOKUP(ROWS($AE$2:AE72),P72:Q820,2,0),\"\")","v":""},null,null,null,null,{"$f":"IFERROR(VLOOKUP(ROWS(AJ$2:$AJ72),O72:Q820,3,0),\"\")","v":""},null,{"$f":"IFERROR(VLOOKUP(ROWS(AL$2:$AL72),N72:Q820,4,0),\"\")","v":""}]
[null,null,null,null,null,null,null,null,null,null,null,null,null,0,0,0,"BNP Paribas Midcap",3259,null,null,null,null,null,null,null,null,null,null,null,null,{"$f":"IFERROR(VLOOKUP(ROWS($AE$2:AE73),P73:Q821,2,0),\"\")","v":""},null,null,null,null,{"$f":"IFERROR(VLOOKUP(ROWS(AJ$2:$AJ73),O73:Q821,3,0),\"\")","v":""},null,{"$f":"IFERROR(VLOOKUP(ROWS(AL$2:$AL73),N73:Q821,4,0),\"\")","v":""}]
[null,null,null,null,null,null,null,null,null,null,null,null,null,0,0,0,"BNP Paribas Midcap Direct",15726,null,null,null,null,null,null,null,null,null,null,null,null,{"$f":"IFERROR(VLOOKUP(ROWS($AE$2:AE74),P74:Q822,2,0),\"\")","v":""},null,null,null,null,{"$f":"IFERROR(VLOOKUP(ROWS(AJ$2:$AJ74),O74:Q822,3,0),\"\")","v":""},null,{"$f":"IFERROR(VLOOKUP(ROWS(AL$2:$AL74),N74:Q822,4,0),\"\")","v":""}]
[null,null,null,null,null,null,null,null,null,null,null,null,null,0,0,0,"BNP Paribas Tax Advantage Direct",15732,null,null,null,null,null,null,null,null,null,null,null,null,{"$f":"IFERROR(VLOOKUP(ROWS($AE$2:AE75),P75:Q823,2,0),\"\")","v":""},null,null,null,null,{"$f":"IFERROR(VLOOKUP(ROWS(AJ$2:$AJ75),O75:Q823,3,0),\"\")","v":""},null,{"$f":"IFERROR(VLOOKUP(ROWS(AL$2:$AL75),N75:Q823,4,0),\"\")","v":""}]
[null,null,null,null,null,null,null,null,null,null,null,null,null,0,0,0,"BNP Paribas Tax Advantage Plan",3001,null,null,null,null,null,null,null,null,null,null,null,null,{"$f":"IFERROR(VLOOKUP(ROWS($AE$2:AE76),P76:Q824,2,0),\"\")","v":""},null,null,null,null,{"$f":"IFERROR(VLOOKUP(ROWS(AJ$2:$AJ76),O76:Q824,3,0),\"\")","v":""},null,{"$f":"IFERROR(VLOOKUP(ROWS(AL$2:$AL76),N76:Q824,4,0),\"\")","v":""}]
[null,null,null,null,null,null,null,null,null,null,null,null,null,0,0,0,"BOI AXA Equity Eco#",8989,null,null,null,null,null,null,null,null,null,null,null,null,{"$f":"IFERROR(VLOOKUP(ROWS($AE$2:AE77),P77:Q825,2,0),\"\")","v":""},null,null,null,null,{"$f":"IFERROR(VLOOKUP(ROWS(AJ$2:$AJ77),O77:Q825,3,0),\"\")","v":""},null,{"$f":"IFERROR(VLOOKUP(ROWS(AL$2:$AL77),N77:Q825,4,0),\"\")","v":""}]
[null,null,null,null,null,null,null,null,null,null,null,null,null,0,0,0,"BOI AXA Equity Reg",8985,null,null,null,null,null,null,null,null,null,null,null,null,{"$f":"IFERROR(VLOOKUP(ROWS($AE$2:AE78),P78:Q826,2,0),\"\")","v":""},null,null,null,null,{"$f":"IFERROR(VLOOKUP(ROWS(AJ$2:$AJ78),O78:Q826,3,0),\"\")","v":""},null,{"$f":"IFERROR(VLOOKUP(ROWS(AL$2:$AL78),N78:Q826,4,0),\"\")","v":""}]
[null,null,null,null,null,null,null,null,null,null,null,null,null,0,0,0,"BOI AXA Equity Reg Direct",16267,null,null,null,null,null,null,null,null,null,null,null,null,{"$f":"IFERROR(VLOOKUP(ROWS($AE$2:AE79),P79:Q827,2,0),\"\")","v":""},null,null,null,null,{"$f":"IFERROR(VLOOKUP(ROWS(AJ$2:$AJ79),O79:Q827,3,0),\"\")","v":""},null,{"$f":"IFERROR(VLOOKUP(ROWS(AL$2:$AL79),N79:Q827,4,0),\"\")","v":""}]
[null,null,null,null,null,null,null,null,null,null,null,null,null,0,0,0,"BOI AXA Focused Infrastructure",10854,null,null,null,null,null,null,null,null,null,null,null,null,{"$f":"IFERROR(VLOOKUP(ROWS($AE$2:AE80),P80:Q828,2,0),\"\")","v":""},null,null,null,null,{"$f":"IFERROR(VLOOKUP(ROWS(AJ$2:$AJ80),O80:Q828,3,0),\"\")","v":""},null,{"$f":"IFERROR(VLOOKUP(ROWS(AL$2:$AL80),N80:Q828,4,0),\"\")","v":""}]
[null,null,null,null,null,null,null,null,null,null,null,null,null,0,0,0,"BOI AXA Focused Infrastructure Direct",15735,null,null,null,null,null,null,null,null,null,null,null,null,{"$f":"IFERROR(VLOOKUP(ROWS($AE$2:AE81),P81:Q829,2,0),\"\")","v":""},null,null,null,null,{"$f":"IFERROR(VLOOKUP(ROWS(AJ$2:$AJ81),O81:Q829,3,0),\"\")","v":""},null,{"$f":"IFERROR(VLOOKUP(ROWS(AL$2:$AL81),N81:Q829,4,0),\"\")","v":""}]
[null,null,null,null,null,null,null,null,null,null,null,null,null,0,0,0,"BOI AXA Tax Advantage Eco#",10099,null,null,null,null,null,null,null,null,null,null,null,null,{"$f":"IFERROR(VLOOKUP(ROWS($AE$2:AE82),P82:Q830,2,0),\"\")","v":""},null,null,null,null,{"$f":"IFERROR(VLOOKUP(ROWS(AJ$2:$AJ82),O82:Q830,3,0),\"\")","v":""},null,{"$f":"IFERROR(VLOOKUP(ROWS(AL$2:$AL82),N82:Q830,4,0),\"\")","v":""}]
[null,null,null,null,null,null,null,null,null,null,null,null,null,0,0,0,"BOI AXA Tax Advantage Reg",10097,null,null,null,null,null,null,null,null,null,null,null,null,{"$f":"IFERROR(VLOOKUP(ROWS($AE$2:AE83),P83:Q831,2,0),\"\")","v":""},null,null,null,null,{"$f":"IFERROR(VLOOKUP(ROWS(AJ$2:$AJ83),O83:Q831,3,0),\"\")","v":""},null,{"$f":"IFERROR(VLOOKUP(ROWS(AL$2:$AL83),N83:Q831,4,0),\"\")","v":""}]
[null,null,null,null,null,null,null,null,null,null,null,null,null,0,0,0,"BOI AXA Tax Advantage Reg Direct",16803,null,null,null,null,null,null,null,null,null,null,null,null,{"$f":"IFERROR(VLOOKUP(ROWS($AE$2:AE84),P84:Q832,2,0),\"\")","v":""},null,null,null,null,{"$f":"IFERROR(VLOOKUP(ROWS(AJ$2:$AJ84),O84:Q832,3,0),\"\")","v":""},null,{"$f":"IFERROR(VLOOKUP(ROWS(AL$2:$AL84),N84:Q832,4,0),\"\")","v":""}]
[null,null,null,null,null,null,null,null,null,null,null,null,null,0,0,0,"Canara Robeco Emerging Equities Regular",2645,null,null,null,null,null,null,null,null,null,null,null,null,{"$f":"IFERROR(VLOOKUP(ROWS($AE$2:AE85),P85:Q833,2,0),\"\")","v":""},null,null,null,null,{"$f":"IFERROR(VLOOKUP(ROWS(AJ$2:$AJ85),O85:Q833,3,0),\"\")","v":""},null,{"$f":"IFERROR(VLOOKUP(ROWS(AL$2:$AL85),N85:Q833,4,0),\"\")","v":""}]
[null,null,null,null,null,null,null,null,null,null,null,null,null,0,0,0,"Canara Robeco Emerging Equities Regular Direct",16581,null,null,null,null,null,null,null,null,null,null,null,null,{"$f":"IFERROR(VLOOKUP(ROWS($AE$2:AE86),P86:Q834,2,0),\"\")","v":""},null,null,null,null,{"$f":"IFERROR(VLOOKUP(ROWS(AJ$2:$AJ86),O86:Q834,3,0),\"\")","v":""},null,{"$f":"IFERROR(VLOOKUP(ROWS(AL$2:$AL86),N86:Q834,4,0),\"\")","v":""}]
[null,null,null,null,null,null,null,null,null,null,null,null,null,0,0,0,"Canara Robeco Equity Diversified Regular",1839,null,null,null,null,null,null,null,null,null,null,null,null,{"$f":"IFERROR(VLOOKUP(ROWS($AE$2:AE87),P87:Q835,2,0),\"\")","v":""},null,null,null,null,{"$f":"IFERROR(VLOOKUP(ROWS(AJ$2:$AJ87),O87:Q835,3,0),\"\")","v":""},null,{"$f":"IFERROR(VLOOKUP(ROWS(AL$2:$AL87),N87:Q835,4,0),\"\")","v":""}]
[null,null,null,null,null,null,null,null,null,null,null,null,null,0,0,0,"Canara Robeco Equity Diversified Regular Direct",16588,null,null,null,null,null,null,null,null,null,null,null,null,{"$f":"IFERROR(VLOOKUP(ROWS($AE$2:AE88),P88:Q836,2,0),\"\")","v":""},null,null,null,null,{"$f":"IFERROR(VLOOKUP(ROWS(AJ$2:$AJ88),O88:Q836,3,0),\"\")","v":""},null,{"$f":"IFERROR(VLOOKUP(ROWS(AL$2:$AL88),N88:Q836,4,0),\"\")","v":""}]
[null,null,null,null,null,null,null,null,null,null,null,null,null,0,0,0,"Canara Robeco Equity Tax Saver Regular",59,null,null,null,null,null,null,null,null,null,null,null,null,{"$f":"IFERROR(VLOOKUP(ROWS($AE$2:AE89),P89:Q837,2,0),\"\")","v":""},null,null,null,null,{"$f":"IFERROR(VLOOKUP(ROWS(AJ$2:$AJ89),O89:Q837,3,0),\"\")","v":""},null,{"$f":"IFERROR(VLOOKUP(ROWS(AL$2:$AL89),N89:Q837,4,0),\"\")","v":""}]
[null,null,null,null,null,null,null,null,null,null,null,null,null,0,0,0,"Canara Robeco Equity Tax Saver Regular Direct",16594,null,null,null,null,null,null,null,null,null,null,null,null,{"$f":"IFERROR(VLOOKUP(ROWS($AE$2:AE90),P90:Q838,2,0),\"\")","v":""},null,null,null,null,{"$f":"IFERROR(VLOOKUP(ROWS(AJ$2:$AJ90),O90:Q838,3,0),\"\")","v":""},null,{"$f":"IFERROR(VLOOKUP(ROWS(AL$2:$AL90),N90:Q838,4,0),\"\")","v":""}]
[null,null,null,null,null,null,null,null,null,null,null,null,null,0,0,0,"Canara Robeco F.O.R.C.E Inst#",10592,null,null,null,null,null,null,null,null,null,null,null,null,{"$f":"IFERROR(VLOOKUP(ROWS($AE$2:AE91),P91:Q839,2,0),\"\")","v":""},null,null,null,null,{"$f":"IFERROR(VLOOKUP(ROWS(AJ$2:$AJ91),O91:Q839,3,0),\"\")","v":""},null,{"$f":"IFERROR(VLOOKUP(ROWS(AL$2:$AL91),N91:Q839,4,0),\"\")","v":""}]
[null,null,null,null,null,null,null,null,null,null,null,null,null,0,0,0,"Canara Robeco F.O.R.C.E Regular",10590,null,null,null,null,null,null,null,null,null,null,null,null,{"$f":"IFERROR(VLOOKUP(ROWS($AE$2:AE92),P92:Q840,2,0),\"\")","v":""},null,null,null,null,{"$f":"IFERROR(VLOOKUP(ROWS(AJ$2:$AJ92),O92:Q840,3,0),\"\")","v":""},null,{"$f":"IFERROR(VLOOKUP(ROWS(AL$2:$AL92),N92:Q840,4,0),\"\")","v":""}]
[null,null,null,null,null,null,null,null,null,null,null,null,null,0,0,0,"Canara Robeco F.O.R.C.E Regular Direct",16600,null,null,null,null,null,null,null,null,null,null,null,null,{"$f":"IFERROR(VLOOKUP(ROWS($AE$2:AE93),P93:Q841,2,0),\"\")","v":""},null,null,null,null,{"$f":"IFERROR(VLOOKUP(ROWS(AJ$2:$AJ93),O93:Q841,3,0),\"\")","v":""},null,{"$f":"IFERROR(VLOOKUP(ROWS(AL$2:$AL93),N93:Q841,4,0),\"\")","v":""}]
[null,null,null,null,null,null,null,null,null,null,null,null,null,0,0,0,"Canara Robeco Infrastructure Direct",15761,null,null,null,null,null,null,null,null,null,null,null,null,{"$f":"IFERROR(VLOOKUP(ROWS($AE$2:AE94),P94:Q842,2,0),\"\")","v":""},null,null,null,null,{"$f":"IFERROR(VLOOKUP(ROWS(AJ$2:$AJ94),O94:Q842,3,0),\"\")","v":""},null,{"$f":"IFERROR(VLOOKUP(ROWS(AL$2:$AL94),N94:Q842,4,0),\"\")","v":""}]
[null,null,null,null,null,null,null,null,null,null,null,null,null,0,0,0,"Canara Robeco Infrastructure Regular",2960,null,null,null,null,null,null,null,null,null,null,null,null,{"$f":"IFERROR(VLOOKUP(ROWS($AE$2:AE95),P95:Q843,2,0),\"\")","v":""},null,null,null,null,{"$f":"IFERROR(VLOOKUP(ROWS(AJ$2:$AJ95),O95:Q843,3,0),\"\")","v":""},null,{"$f":"IFERROR(VLOOKUP(ROWS(AL$2:$AL95),N95:Q843,4,0),\"\")","v":""}]
[null,null,null,null,null,null,null,null,null,null,null,null,null,0,0,0,"Canara Robeco Large Cap+ Direct",15765,null,null,null,null,null,null,null,null,null,null,null,null,{"$f":"IFERROR(VLOOKUP(ROWS($AE$2:AE96),P96:Q844,2,0),\"\")","v":""},null,null,null,null,{"$f":"IFERROR(VLOOKUP(ROWS(AJ$2:$AJ96),O96:Q844,3,0),\"\")","v":""},null,{"$f":"IFERROR(VLOOKUP(ROWS(AL$2:$AL96),N96:Q844,4,0),\"\")","v":""}]
[null,null,null,null,null,null,null,null,null,null,null,null,null,0,0,0,"Canara Robeco Large Cap+ Regular",11333,null,null,null,null,null,null,null,null,null,null,null,null,{"$f":"IFERROR(VLOOKUP(ROWS($AE$2:AE97),P97:Q845,2,0),\"\")","v":""},null,null,null,null,{"$f":"IFERROR(VLOOKUP(ROWS(AJ$2:$AJ97),O97:Q845,3,0),\"\")","v":""},null,{"$f":"IFERROR(VLOOKUP(ROWS(AL$2:$AL97),N97:Q845,4,0),\"\")","v":""}]
[null,null,null,null,null,null,null,null,null,null,null,null,null,0,0,0,"Canara Robeco Nifty Index Direct",15776,null,null,null,null,null,null,null,null,null,null,null,null,{"$f":"IFERROR(VLOOKUP(ROWS($AE$2:AE98),P98:Q846,2,0),\"\")","v":""},null,null,null,null,{"$f":"IFERROR(VLOOKUP(ROWS(AJ$2:$AJ98),O98:Q846,3,0),\"\")","v":""},null,{"$f":"IFERROR(VLOOKUP(ROWS(AL$2:$AL98),N98:Q846,4,0),\"\")","v":""}]
[null,null,null,null,null,null,null,null,null,null,null,null,null,0,0,0,"Canara Robeco Nifty Index Regular",2472,null,null,null,null,null,null,null,null,null,null,null,null,{"$f":"IFERROR(VLOOKUP(ROWS($AE$2:AE99),P99:Q847,2,0),\"\")","v":""},null,null,null,null,{"$f":"IFERROR(VLOOKUP(ROWS(AJ$2:$AJ99),O99:Q847,3,0),\"\")","v":""},null,{"$f":"IFERROR(VLOOKUP(ROWS(AL$2:$AL99),N99:Q847,4,0),\"\")","v":""}]
[null,null,null,null,null,null,null,null,null,null,null,null,null,0,0,0,"Daiwa Industry Leaders",10603,null,null,null,null,null,null,null,null,null,null,null,null,{"$f":"IFERROR(VLOOKUP(ROWS($AE$2:AE100),P100:Q848,2,0),\"\")","v":""},null,null,null,null,{"$f":"IFERROR(VLOOKUP(ROWS(AJ$2:$AJ100),O100:Q848,3,0),\"\")","v":""},null,{"$f":"IFERROR(VLOOKUP(ROWS(AL$2:$AL100),N100:Q848,4,0),\"\")","v":""}]
[null,null,null,null,null,null,null,null,null,null,null,null,null,0,0,0,"Daiwa Industry Leaders Direct",15787,null,null,null,null,null,null,null,null,null,null,null,null,{"$f":"IFERROR(VLOOKUP(ROWS($AE$2:AE101),P101:Q849,2,0),\"\")","v":""},null,null,null,null,{"$f":"IFERROR(VLOOKUP(ROWS(AJ$2:$AJ101),O101:Q849,3,0),\"\")","v":""},null,{"$f":"IFERROR(VLOOKUP(ROWS(AL$2:$AL101),N101:Q849,4,0),\"\")","v":""}]
[null,null,null,null,null,null,null,null,null,null,null,null,null,0,0,0,"DSPBR Equity",393,null,null,null,null,null,null,null,null,null,null,null,null,{"$f":"IFERROR(VLOOKUP(ROWS($AE$2:AE102),P102:Q850,2,0),\"\")","v":""},null,null,null,null,{"$f":"IFERROR(VLOOKUP(ROWS(AJ$2:$AJ102),O102:Q850,3,0),\"\")","v":""},null,{"$f":"IFERROR(VLOOKUP(ROWS(AL$2:$AL102),N102:Q850,4,0),\"\")","v":""}]
[null,null,null,null,null,null,null,null,null,null,null,null,null,0,0,0,"DSPBR Equity Direct",16386,null,null,null,null,null,null,null,null,null,null,null,null,{"$f":"IFERROR(VLOOKUP(ROWS($AE$2:AE103),P103:Q851,2,0),\"\")","v":""},null,null,null,null,{"$f":"IFERROR(VLOOKUP(ROWS(AJ$2:$AJ103),O103:Q851,3,0),\"\")","v":""},null,{"$f":"IFERROR(VLOOKUP(ROWS(AL$2:$AL103),N103:Q851,4,0),\"\")","v":""}]
[null,null,null,null,null,null,null,null,null,null,null,null,null,0,0,0,"DSPBR Equity Inst#",5609,null,null,null,null,null,null,null,null,null,null,null,null,{"$f":"IFERROR(VLOOKUP(ROWS($AE$2:AE104),P104:Q852,2,0),\"\")","v":""},null,null,null,null,{"$f":"IFERROR(VLOOKUP(ROWS(AJ$2:$AJ104),O104:Q852,3,0),\"\")","v":""},null,{"$f":"IFERROR(VLOOKUP(ROWS(AL$2:$AL104),N104:Q852,4,0),\"\")","v":""}]
[null,null,null,null,null,null,null,null,null,null,null,null,null,0,0,0,"DSPBR Focus 25",11183,null,null,null,null,null,null,null,null,null,null,null,null,{"$f":"IFERROR(VLOOKUP(ROWS($AE$2:AE105),P105:Q853,2,0),\"\")","v":""},null,null,null,null,{"$f":"IFERROR(VLOOKUP(ROWS(AJ$2:$AJ105),O105:Q853,3,0),\"\")","v":""},null,{"$f":"IFERROR(VLOOKUP(ROWS(AL$2:$AL105),N105:Q853,4,0),\"\")","v":""}]
[null,null,null,null,null,null,null,null,null,null,null,null,null,0,0,0,"DSPBR Focus 25 Direct",16388,null,null,null,null,null,null,null,null,null,null,null,null,{"$f":"IFERROR(VLOOKUP(ROWS($AE$2:AE106),P106:Q854,2,0),\"\")","v":""},null,null,null,null,{"$f":"IFERROR(VLOOKUP(ROWS(AJ$2:$AJ106),O106:Q854,3,0),\"\")","v":""},null,{"$f":"IFERROR(VLOOKUP(ROWS(AL$2:$AL106),N106:Q854,4,0),\"\")","v":""}]
[null,null,null,null,null,null,null,null,null,null,null,null,null,0,0,0,"DSPBR Micro Cap Reg",5069,null,null,null,null,null,null,null,null,null,null,null,null,{"$f":"IFERROR(VLOOKUP(ROWS($AE$2:AE107),P107:Q855,2,0),\"\")","v":""},null,null,null,null,{"$f":"IFERROR(VLOOKUP(ROWS(AJ$2:$AJ107),O107:Q855,3,0),\"\")","v":""},null,{"$f":"IFERROR(VLOOKUP(ROWS(AL$2:$AL107),N107:Q855,4,0),\"\")","v":""}]
[null,null,null,null,null,null,null,null,null,null,null,null,null,0,0,0,"DSPBR Micro Cap Reg Direct",16411,null,null,null,null,null,null,null,null,null,null,null,null,{"$f":"IFERROR(VLOOKUP(ROWS($AE$2:AE108),P108:Q856,2,0),\"\")","v":""},null,null,null,null,{"$f":"IFERROR(VLOOKUP(ROWS(AJ$2:$AJ108),O108:Q856,3,0),\"\")","v":""},null,{"$f":"IFERROR(VLOOKUP(ROWS(AL$2:$AL108),N108:Q856,4,0),\"\")","v":""}]
[null,null,null,null,null,null,null,null,null,null,null,null,null,0,0,0,"DSPBR Natural Resources and New Energy Reg",7128,null,null,null,null,null,null,null,null,null,null,null,null,{"$f":"IFERROR(VLOOKUP(ROWS($AE$2:AE109),P109:Q857,2,0),\"\")","v":""},null,null,null,null,{"$f":"IFERROR(VLOOKUP(ROWS(AJ$2:$AJ109),O109:Q857,3,0),\"\")","v":""},null,{"$f":"IFERROR(VLOOKUP(ROWS(AL$2:$AL109),N109:Q857,4,0),\"\")","v":""}]
[null,null,null,null,null,null,null,null,null,null,null,null,null,0,0,0,"DSPBR Natural Resources and New Energy Reg Direct",16988,null,null,null,null,null,null,null,null,null,null,null,null,{"$f":"IFERROR(VLOOKUP(ROWS($AE$2:AE110),P110:Q858,2,0),\"\")","v":""},null,null,null,null,{"$f":"IFERROR(VLOOKUP(ROWS(AJ$2:$AJ110),O110:Q858,3,0),\"\")","v":""},null,{"$f":"IFERROR(VLOOKUP(ROWS(AL$2:$AL110),N110:Q858,4,0),\"\")","v":""}]
[null,null,null,null,null,null,null,null,null,null,null,null,null,0,0,0,"DSPBR Opportunities",776,null,null,null,null,null,null,null,null,null,null,null,null,{"$f":"IFERROR(VLOOKUP(ROWS($AE$2:AE111),P111:Q859,2,0),\"\")","v":""},null,null,null,null,{"$f":"IFERROR(VLOOKUP(ROWS(AJ$2:$AJ111),O111:Q859,3,0),\"\")","v":""},null,{"$f":"IFERROR(VLOOKUP(ROWS(AL$2:$AL111),N111:Q859,4,0),\"\")","v":""}]
[null,null,null,null,null,null,null,null,null,null,null,null,null,0,0,0,"DSPBR Opportunities Direct",16425,null,null,null,null,null,null,null,null,null,null,null,null,{"$f":"IFERROR(VLOOKUP(ROWS($AE$2:AE112),P112:Q860,2,0),\"\")","v":""},null,null,null,null,{"$f":"IFERROR(VLOOKUP(ROWS(AJ$2:$AJ112),O112:Q860,3,0),\"\")","v":""},null,{"$f":"IFERROR(VLOOKUP(ROWS(AL$2:$AL112),N112:Q860,4,0),\"\")","v":""}]
[null,null,null,null,null,null,null,null,null,null,null,null,null,0,0,0,"DSPBR Small and Mid Cap Reg",3725,null,null,null,null,null,null,null,null,null,null,null,null,{"$f":"IFERROR(VLOOKUP(ROWS($AE$2:AE113),P113:Q861,2,0),\"\")","v":""},null,null,null,null,{"$f":"IFERROR(VLOOKUP(ROWS(AJ$2:$AJ113),O113:Q861,3,0),\"\")","v":""},null,{"$f":"IFERROR(VLOOKUP(ROWS(AL$2:$AL113),N113:Q861,4,0),\"\")","v":""}]
[null,null,null,null,null,null,null,null,null,null,null,null,null,0,0,0,"DSPBR Small and Mid Cap Reg Direct",16438,null,null,null,null,null,null,null,null,null,null,null,null,{"$f":"IFERROR(VLOOKUP(ROWS($AE$2:AE114),P114:Q862,2,0),\"\")","v":""},null,null,null,null,{"$f":"IFERROR(VLOOKUP(ROWS(AJ$2:$AJ114),O114:Q862,3,0),\"\")","v":""},null,{"$f":"IFERROR(VLOOKUP(ROWS(AL$2:$AL114),N114:Q862,4,0),\"\")","v":""}]
[null,null,null,null,null,null,null,null,null,null,null,null,null,0,0,0,"DSPBR T.I.G.E.R. Inst#",5240,null,null,null,null,null,null,null,null,null,null,null,null,{"$f":"IFERROR(VLOOKUP(ROWS($AE$2:AE115),P115:Q863,2,0),\"\")","v":""},null,null,null,null,{"$f":"IFERROR(VLOOKUP(ROWS(AJ$2:$AJ115),O115:Q863,3,0),\"\")","v":""},null,{"$f":"IFERROR(VLOOKUP(ROWS(AL$2:$AL115),N115:Q863,4,0),\"\")","v":""}]
[null,null,null,null,null,null,null,null,null,null,null,null,null,0,0,0,"DSPBR T.I.G.E.R. Reg",2222,null,null,null,null,null,null,null,null,null,null,null,null,{"$f":"IFERROR(VLOOKUP(ROWS($AE$2:AE116),P116:Q864,2,0),\"\")","v":""},null,null,null,null,{"$f":"IFERROR(VLOOKUP(ROWS(AJ$2:$AJ116),O116:Q864,3,0),\"\")","v":""},null,{"$f":"IFERROR(VLOOKUP(ROWS(AL$2:$AL116),N116:Q864,4,0),\"\")","v":""}]
[null,null,null,null,null,null,null,null,null,null,null,null,null,0,0,0,"DSPBR T.I.G.E.R. Reg Direct",16410,null,null,null,null,null,null,null,null,null,null,null,null,{"$f":"IFERROR(VLOOKUP(ROWS($AE$2:AE117),P117:Q865,2,0),\"\")","v":""},null,null,null,null,{"$f":"IFERROR(VLOOKUP(ROWS(AJ$2:$AJ117),O117:Q865,3,0),\"\")","v":""},null,{"$f":"IFERROR(VLOOKUP(ROWS(AL$2:$AL117),N117:Q865,4,0),\"\")","v":""}]
[null,null,null,null,null,null,null,null,null,null,null,null,null,0,0,0,"DSPBR Tax Saver",3985,null,null,null,null,null,null,null,null,null,null,null,null,{"$f":"IFERROR(VLOOKUP(ROWS($AE$2:AE118),P118:Q866,2,0),\"\")","v":""},null,null,null,null,{"$f":"IFERROR(VLOOKUP(ROWS(AJ$2:$AJ118),O118:Q866,3,0),\"\")","v":""},null,{"$f":"IFERROR(VLOOKUP(ROWS(AL$2:$AL118),N118:Q866,4,0),\"\")","v":""}]
[null,null,null,null,null,null,null,null,null,null,null,null,null,0,0,0,"DSPBR Tax Saver Direct",16454,null,null,null,null,null,null,null,null,null,null,null,null,{"$f":"IFERROR(VLOOKUP(ROWS($AE$2:AE119),P119:Q867,2,0),\"\")","v":""},null,null,null,null,{"$f":"IFERROR(VLOOKUP(ROWS(AJ$2:$AJ119),O119:Q867,3,0),\"\")","v":""},null,{"$f":"IFERROR(VLOOKUP(ROWS(AL$2:$AL119),N119:Q867,4,0),\"\")","v":""}]
[null,null,null,null,null,null,null,null,null,null,null,null,null,0,0,0,"DSPBR Technology.com Reg",774,null,null,null,null,null,null,null,null,null,null,null,null,{"$f":"IFERROR(VLOOKUP(ROWS($AE$2:AE120),P120:Q868,2,0),\"\")","v":""},null,null,null,null,{"$f":"IFERROR(VLOOKUP(ROWS(AJ$2:$AJ120),O120:Q868,3,0),\"\")","v":""},null,{"$f":"IFERROR(VLOOKUP(ROWS(AL$2:$AL120),N120:Q868,4,0),\"\")","v":""}]
[null,null,null,null,null,null,null,null,null,null,null,null,null,0,0,0,"DSPBR Technology.com Reg Direct",17003,null,null,null,null,null,null,null,null,null,null,null,null,{"$f":"IFERROR(VLOOKUP(ROWS($AE$2:AE121),P121:Q869,2,0),\"\")","v":""},null,null,null,null,{"$f":"IFERROR(VLOOKUP(ROWS(AJ$2:$AJ121),O121:Q869,3,0),\"\")","v":""},null,{"$f":"IFERROR(VLOOKUP(ROWS(AL$2:$AL121),N121:Q869,4,0),\"\")","v":""}]
[null,null,null,null,null,null,null,null,null,null,null,null,null,0,0,0,"DSPBR Top 100 Equity Inst#",5219,null,null,null,null,null,null,null,null,null,null,null,null,{"$f":"IFERROR(VLOOKUP(ROWS($AE$2:AE122),P122:Q870,2,0),\"\")","v":""},null,null,null,null,{"$f":"IFERROR(VLOOKUP(ROWS(AJ$2:$AJ122),O122:Q870,3,0),\"\")","v":""},null,{"$f":"IFERROR(VLOOKUP(ROWS(AL$2:$AL122),N122:Q870,4,0),\"\")","v":""}]
[null,null,null,null,null,null,null,null,null,null,null,null,null,0,0,0,"DSPBR Top 100 Equity Reg",1540,null,null,null,null,null,null,null,null,null,null,null,null,{"$f":"IFERROR(VLOOKUP(ROWS($AE$2:AE123),P123:Q871,2,0),\"\")","v":""},null,null,null,null,{"$f":"IFERROR(VLOOKUP(ROWS(AJ$2:$AJ123),O123:Q871,3,0),\"\")","v":""},null,{"$f":"IFERROR(VLOOKUP(ROWS(AL$2:$AL123),N123:Q871,4,0),\"\")","v":""}]
[null,null,null,null,null,null,null,null,null,null,null,null,null,0,0,0,"DSPBR Top 100 Equity Reg Direct",16456,null,null,null,null,null,null,null,null,null,null,null,null,{"$f":"IFERROR(VLOOKUP(ROWS($AE$2:AE124),P124:Q872,2,0),\"\")","v":""},null,null,null,null,{"$f":"IFERROR(VLOOKUP(ROWS(AJ$2:$AJ124),O124:Q872,3,0),\"\")","v":""},null,{"$f":"IFERROR(VLOOKUP(ROWS(AL$2:$AL124),N124:Q872,4,0),\"\")","v":""}]
[null,null,null,null,null,null,null,null,null,null,null,null,null,0,0,0,"DSPBR US Flexible Equity",15152,null,null,null,null,null,null,null,null,null,null,null,null,{"$f":"IFERROR(VLOOKUP(ROWS($AE$2:AE125),P125:Q873,2,0),\"\")","v":""},null,null,null,null,{"$f":"IFERROR(VLOOKUP(ROWS(AJ$2:$AJ125),O125:Q873,3,0),\"\")","v":""},null,{"$f":"IFERROR(VLOOKUP(ROWS(AL$2:$AL125),N125:Q873,4,0),\"\")","v":""}]
[null,null,null,null,null,null,null,null,null,null,null,null,null,0,0,0,"DSPBR US Flexible Equity Direct",17006,null,null,null,null,null,null,null,null,null,null,null,null,{"$f":"IFERROR(VLOOKUP(ROWS($AE$2:AE126),P126:Q874,2,0),\"\")","v":""},null,null,null,null,{"$f":"IFERROR(VLOOKUP(ROWS(AJ$2:$AJ126),O126:Q874,3,0),\"\")","v":""},null,{"$f":"IFERROR(VLOOKUP(ROWS(AL$2:$AL126),N126:Q874,4,0),\"\")","v":""}]
[null,null,null,null,null,null,null,null,null,null,null,null,null,0,0,0,"DSPBR World Agriculture",13395,null,null,null,null,null,null,null,null,null,null,null,null,{"$f":"IFERROR(VLOOKUP(ROWS($AE$2:AE127),P127:Q875,2,0),\"\")","v":""},null,null,null,null,{"$f":"IFERROR(VLOOKUP(ROWS(AJ$2:$AJ127),O127:Q875,3,0),\"\")","v":""},null,{"$f":"IFERROR(VLOOKUP(ROWS(AL$2:$AL127),N127:Q875,4,0),\"\")","v":""}]
[null,null,null,null,null,null,null,null,null,null,null,null,null,0,0,0,"DSPBR World Agriculture Direct",17009,null,null,null,null,null,null,null,null,null,null,null,null,{"$f":"IFERROR(VLOOKUP(ROWS($AE$2:AE128),P128:Q876,2,0),\"\")","v":""},null,null,null,null,{"$f":"IFERROR(VLOOKUP(ROWS(AJ$2:$AJ128),O128:Q876,3,0),\"\")","v":""},null,{"$f":"IFERROR(VLOOKUP(ROWS(AL$2:$AL128),N128:Q876,4,0),\"\")","v":""}]
[null,null,null,null,null,null,null,null,null,null,null,null,null,0,0,0,"DSPBR World Energy Reg",10559,null,null,null,null,null,null,null,null,null,null,null,null,{"$f":"IFERROR(VLOOKUP(ROWS($AE$2:AE129),P129:Q877,2,0),\"\")","v":""},null,null,null,null,{"$f":"IFERROR(VLOOKUP(ROWS(AJ$2:$AJ129),O129:Q877,3,0),\"\")","v":""},null,{"$f":"IFERROR(VLOOKUP(ROWS(AL$2:$AL129),N129:Q877,4,0),\"\")","v":""}]
[null,null,null,null,null,null,null,null,null,null,null,null,null,0,0,{"$f":"IF(ISNUMBER(SEARCH($H$6,Q130)),MAX($P$1,P129)+1,0)","v":0},"DSPBR World Energy Reg Direct",17012,null,null,null,null,null,null,null,null,null,null,null,null,{"$f":"IFERROR(VLOOKUP(ROWS($AE$2:AE130),P130:Q878,2,0),\"\")","v":""},null,null,null,null,{"$f":"IFERROR(VLOOKUP(ROWS(AJ$2:$AJ130),O130:Q878,3,0),\"\")","v":""},null,{"$f":"IFERROR(VLOOKUP(ROWS(AL$2:$AL130),N130:Q878,4,0),\"\")","v":""}]
[null,null,null,null,null,null,null,null,null,null,null,null,null,{"$f":"IF(ISNUMBER(SEARCH($H$16,Q131)),MAX($N$1,N130)+1,0)","v":0},{"$f":"IF(ISNUMBER(SEARCH($H$11,Q131)),MAX($O$1,O130)+1,0)","v":0},0,"DSPBR World Gold Reg",5623,null,null,null,null,null,null,null,null,null,null,null,null,{"$f":"IFERROR(VLOOKUP(ROWS($AE$2:AE131),P131:Q879,2,0),\"\")","v":""},null,null,null,null,{"$f":"IFERROR(VLOOKUP(ROWS(AJ$2:$AJ131),O131:Q879,3,0),\"\")","v":""},null,{"$f":"IFERROR(VLOOKUP(ROWS(AL$2:$AL131),N131:Q879,4,0),\"\")","v":""}]
[null,null,null,null,null,null,null,null,null,null,null,null,null,0,0,0,"DSPBR World Gold Reg Direct",17016,null,null,null,null,null,null,null,null,null,null,null,null,{"$f":"IFERROR(VLOOKUP(ROWS($AE$2:AE132),P132:Q880,2,0),\"\")","v":""},null,null,null,null,{"$f":"IFERROR(VLOOKUP(ROWS(AJ$2:$AJ132),O132:Q880,3,0),\"\")","v":""},null,{"$f":"IFERROR(VLOOKUP(ROWS(AL$2:$AL132),N132:Q880,4,0),\"\")","v":""}]
[null,null,null,null,null,null,null,null,null,null,null,null,null,0,0,0,"DSPBR World Mining Reg",10799,null,null,null,null,null,null,null,null,null,null,null,null,{"$f":"IFERROR(VLOOKUP(ROWS($AE$2:AE133),P133:Q881,2,0),\"\")","v":""},null,null,null,null,{"$f":"IFERROR(VLOOKUP(ROWS(AJ$2:$AJ133),O133:Q881,3,0),\"\")","v":""},null,{"$f":"IFERROR(VLOOKUP(ROWS(AL$2:$AL133),N133:Q881,4,0),\"\")","v":""}]
[null,null,null,null,null,null,null,null,null,null,null,null,null,0,0,0,"DSPBR World Mining Reg Direct",17021,null,null,null,null,null,null,null,null,null,null,null,null,{"$f":"IFERROR(VLOOKUP(ROWS($AE$2:AE134),P134:Q882,2,0),\"\")","v":""},null,null,null,null,{"$f":"IFERROR(VLOOKUP(ROWS(AJ$2:$AJ134),O134:Q882,3,0),\"\")","v":""},null,{"$f":"IFERROR(VLOOKUP(ROWS(AL$2:$AL134),N134:Q882,4,0),\"\")","v":""}]
[null,null,null,null,null,null,null,null,null,null,null,null,null,0,0,0,"DWS Alpha Equity Direct",15574,null,null,null,null,null,null,null,null,null,null,null,null,{"$f":"IFERROR(VLOOKUP(ROWS($AE$2:AE135),P135:Q883,2,0),\"\")","v":""},null,null,null,null,{"$f":"IFERROR(VLOOKUP(ROWS(AJ$2:$AJ135),O135:Q883,3,0),\"\")","v":""},null,{"$f":"IFERROR(VLOOKUP(ROWS(AL$2:$AL135),N135:Q883,4,0),\"\")","v":""}]
[null,null,null,null,null,null,null,null,null,null,null,null,null,0,0,0,"DWS Alpha Equity Regular",1513,null,null,null,null,null,null,null,null,null,null,null,null,{"$f":"IFERROR(VLOOKUP(ROWS($AE$2:AE136),P136:Q884,2,0),\"\")","v":""},null,null,null,null,{"$f":"IFERROR(VLOOKUP(ROWS(AJ$2:$AJ136),O136:Q884,3,0),\"\")","v":""},null,{"$f":"IFERROR(VLOOKUP(ROWS(AL$2:$AL136),N136:Q884,4,0),\"\")","v":""}]
[null,null,null,null,null,null,null,null,null,null,null,null,null,0,0,0,"DWS Alpha Equity Wealth Plan#",10438,null,null,null,null,null,null,null,null,null,null,null,null,{"$f":"IFERROR(VLOOKUP(ROWS($AE$2:AE137),P137:Q885,2,0),\"\")","v":""},null,null,null,null,{"$f":"IFERROR(VLOOKUP(ROWS(AJ$2:$AJ137),O137:Q885,3,0),\"\")","v":""},null,{"$f":"IFERROR(VLOOKUP(ROWS(AL$2:$AL137),N137:Q885,4,0),\"\")","v":""}]
[null,null,null,null,null,null,null,null,null,null,null,null,null,0,0,0,"DWS Global Agribusiness Offshore Reg",11136,null,null,null,null,null,null,null,null,null,null,null,null,{"$f":"IFERROR(VLOOKUP(ROWS($AE$2:AE138),P138:Q886,2,0),\"\")","v":""},null,null,null,null,{"$f":"IFERROR(VLOOKUP(ROWS(AJ$2:$AJ138),O138:Q886,3,0),\"\")","v":""},null,{"$f":"IFERROR(VLOOKUP(ROWS(AL$2:$AL138),N138:Q886,4,0),\"\")","v":""}]
[null,null,null,null,null,null,null,null,null,null,null,null,null,0,0,0,"DWS Global Agribusiness Offshore Reg Direct",17348,null,null,null,null,null,null,null,null,null,null,null,null,{"$f":"IFERROR(VLOOKUP(ROWS($AE$2:AE139),P139:Q887,2,0),\"\")","v":""},null,null,null,null,{"$f":"IFERROR(VLOOKUP(ROWS(AJ$2:$AJ139),O139:Q887,3,0),\"\")","v":""},null,{"$f":"IFERROR(VLOOKUP(ROWS(AL$2:$AL139),N139:Q887,4,0),\"\")","v":""}]
[null,null,null,null,null,null,null,null,null,null,null,null,null,0,0,0,"DWS Global Thematic Offshore",5558,null,null,null,null,null,null,null,null,null,null,null,null,{"$f":"IFERROR(VLOOKUP(ROWS($AE$2:AE140),P140:Q888,2,0),\"\")","v":""},null,null,null,null,{"$f":"IFERROR(VLOOKUP(ROWS(AJ$2:$AJ140),O140:Q888,3,0),\"\")","v":""},null,{"$f":"IFERROR(VLOOKUP(ROWS(AL$2:$AL140),N140:Q888,4,0),\"\")","v":""}]
[null,null,null,null,null,null,null,null,null,null,null,null,null,0,0,0,"DWS Global Thematic Offshore Direct",17349,null,null,null,null,null,null,null,null,null,null,null,null,{"$f":"IFERROR(VLOOKUP(ROWS($AE$2:AE141),P141:Q889,2,0),\"\")","v":""},null,null,null,null,{"$f":"IFERROR(VLOOKUP(ROWS(AJ$2:$AJ141),O141:Q889,3,0),\"\")","v":""},null,{"$f":"IFERROR(VLOOKUP(ROWS(AL$2:$AL141),N141:Q889,4,0),\"\")","v":""}]
[null,null,null,null,null,null,null,null,null,null,null,null,null,0,0,0,"DWS Investment Opportunity Direct",15620,null,null,null,null,null,null,null,null,null,null,null,null,{"$f":"IFERROR(VLOOKUP(ROWS($AE$2:AE142),P142:Q890,2,0),\"\")","v":""},null,null,null,null,{"$f":"IFERROR(VLOOKUP(ROWS(AJ$2:$AJ142),O142:Q890,3,0),\"\")","v":""},null,{"$f":"IFERROR(VLOOKUP(ROWS(AL$2:$AL142),N142:Q890,4,0),\"\")","v":""}]
[null,null,null,null,null,null,null,null,null,null,null,null,null,0,0,0,"DWS Investment Opportunity Regular",2057,null,null,null,null,null,null,null,null,null,null,null,null,{"$f":"IFERROR(VLOOKUP(ROWS($AE$2:AE143),P143:Q891,2,0),\"\")","v":""},null,null,null,null,{"$f":"IFERROR(VLOOKUP(ROWS(AJ$2:$AJ143),O143:Q891,3,0),\"\")","v":""},null,{"$f":"IFERROR(VLOOKUP(ROWS(AL$2:$AL143),N143:Q891,4,0),\"\")","v":""}]
[null,null,null,null,null,null,null,null,null,null,null,null,null,0,0,0,"DWS Investment Opportunity Wealth Plan#",10440,null,null,null,null,null,null,null,null,null,null,null,null,{"$f":"IFERROR(VLOOKUP(ROWS($AE$2:AE144),P144:Q892,2,0),\"\")","v":""},null,null,null,null,{"$f":"IFERROR(VLOOKUP(ROWS(AJ$2:$AJ144),O144:Q892,3,0),\"\")","v":""},null,{"$f":"IFERROR(VLOOKUP(ROWS(AL$2:$AL144),N144:Q892,4,0),\"\")","v":""}]
[null,null,null,null,null,null,null,null,null,null,null,null,null,0,0,0,"DWS Tax Saving",3126,null,null,null,null,null,null,null,null,null,null,null,null,{"$f":"IFERROR(VLOOKUP(ROWS($AE$2:AE145),P145:Q893,2,0),\"\")","v":""},null,null,null,null,{"$f":"IFERROR(VLOOKUP(ROWS(AJ$2:$AJ145),O145:Q893,3,0),\"\")","v":""},null,{"$f":"IFERROR(VLOOKUP(ROWS(AL$2:$AL145),N145:Q893,4,0),\"\")","v":""}]
[null,null,null,null,null,null,null,null,null,null,null,null,null,0,0,0,"DWS Tax Saving Direct",17350,null,null,null,null,null,null,null,null,null,null,null,null,{"$f":"IFERROR(VLOOKUP(ROWS($AE$2:AE146),P146:Q894,2,0),\"\")","v":""},null,null,null,null,{"$f":"IFERROR(VLOOKUP(ROWS(AJ$2:$AJ146),O146:Q894,3,0),\"\")","v":""},null,{"$f":"IFERROR(VLOOKUP(ROWS(AL$2:$AL146),N146:Q894,4,0),\"\")","v":""}]
[null,null,null,null,null,null,null,null,null,null,null,null,null,0,0,0,"Edelweiss Diversified Growth Equity Top 100",10432,null,null,null,null,null,null,null,null,null,null,null,null,{"$f":"IFERROR(VLOOKUP(ROWS($AE$2:AE147),P147:Q895,2,0),\"\")","v":""},null,null,null,null,{"$f":"IFERROR(VLOOKUP(ROWS(AJ$2:$AJ147),O147:Q895,3,0),\"\")","v":""},null,{"$f":"IFERROR(VLOOKUP(ROWS(AL$2:$AL147),N147:Q895,4,0),\"\")","v":""}]
[null,null,null,null,null,null,null,null,null,null,null,null,null,0,0,0,"Edelweiss Diversified Growth Equity Top 100 Direct",17352,null,null,null,null,null,null,null,null,null,null,null,null,{"$f":"IFERROR(VLOOKUP(ROWS($AE$2:AE148),P148:Q896,2,0),\"\")","v":""},null,null,null,null,{"$f":"IFERROR(VLOOKUP(ROWS(AJ$2:$AJ148),O148:Q896,3,0),\"\")","v":""},null,{"$f":"IFERROR(VLOOKUP(ROWS(AL$2:$AL148),N148:Q896,4,0),\"\")","v":""}]
[null,null,null,null,null,null,null,null,null,null,null,null,null,0,0,0,"Edelweiss Diversified Growth Equity Top 100 Plan B#",10434,null,null,null,null,null,null,null,null,null,null,null,null,{"$f":"IFERROR(VLOOKUP(ROWS($AE$2:AE149),P149:Q897,2,0),\"\")","v":""},null,null,null,null,{"$f":"IFERROR(VLOOKUP(ROWS(AJ$2:$AJ149),O149:Q897,3,0),\"\")","v":""},null,{"$f":"IFERROR(VLOOKUP(ROWS(AL$2:$AL149),N149:Q897,4,0),\"\")","v":""}]
[null,null,null,null,null,null,null,null,null,null,null,null,null,0,0,0,"Edelweiss Diversified Growth Equity Top 100 Plan C#",10436,null,null,null,null,null,null,null,null,null,null,null,null,{"$f":"IFERROR(VLOOKUP(ROWS($AE$2:AE150),P150:Q898,2,0),\"\")","v":""},null,null,null,null,{"$f":"IFERROR(VLOOKUP(ROWS(AJ$2:$AJ150),O150:Q898,3,0),\"\")","v":""},null,{"$f":"IFERROR(VLOOKUP(ROWS(AL$2:$AL150),N150:Q898,4,0),\"\")","v":""}]
[null,null,null,null,null,null,null,null,null,null,null,null,null,0,0,0,"Edelweiss ELSS",10125,null,null,null,null,null,null,null,null,null,null,null,null,{"$f":"IFERROR(VLOOKUP(ROWS($AE$2:AE151),P151:Q899,2,0),\"\")","v":""},null,null,null,null,{"$f":"IFERROR(VLOOKUP(ROWS(AJ$2:$AJ151),O151:Q899,3,0),\"\")","v":""},null,{"$f":"IFERROR(VLOOKUP(ROWS(AL$2:$AL151),N151:Q899,4,0),\"\")","v":""}]
[null,null,null,null,null,null,null,null,null,null,null,null,null,0,0,0,"Edelweiss ELSS Direct",17762,null,null,null,null,null,null,null,null,null,null,null,null,{"$f":"IFERROR(VLOOKUP(ROWS($AE$2:AE152),P152:Q900,2,0),\"\")","v":""},null,null,null,null,{"$f":"IFERROR(VLOOKUP(ROWS(AJ$2:$AJ152),O152:Q900,3,0),\"\")","v":""},null,{"$f":"IFERROR(VLOOKUP(ROWS(AL$2:$AL152),N152:Q900,4,0),\"\")","v":""}]
[null,null,null,null,null,null,null,null,null,null,null,null,null,0,0,0,"Edelweiss Equity Enhancer",10609,null,null,null,null,null,null,null,null,null,null,null,null,{"$f":"IFERROR(VLOOKUP(ROWS($AE$2:AE153),P153:Q901,2,0),\"\")","v":""},null,null,null,null,{"$f":"IFERROR(VLOOKUP(ROWS(AJ$2:$AJ153),O153:Q901,3,0),\"\")","v":""},null,{"$f":"IFERROR(VLOOKUP(ROWS(AL$2:$AL153),N153:Q901,4,0),\"\")","v":""}]
[null,null,null,null,null,null,null,null,null,null,null,null,null,0,0,0,"Edelweiss Equity Enhancer Direct",17354,null,null,null,null,null,null,null,null,null,null,null,null,{"$f":"IFERROR(VLOOKUP(ROWS($AE$2:AE154),P154:Q902,2,0),\"\")","v":""},null,null,null,null,{"$f":"IFERROR(VLOOKUP(ROWS(AJ$2:$AJ154),O154:Q902,3,0),\"\")","v":""},null,{"$f":"IFERROR(VLOOKUP(ROWS(AL$2:$AL154),N154:Q902,4,0),\"\")","v":""}]
[null,null,null,null,null,null,null,null,null,null,null,null,null,0,0,0,"Edelweiss Equity Enhancer Plan B#",10478,null,null,null,null,null,null,null,null,null,null,null,null,{"$f":"IFERROR(VLOOKUP(ROWS($AE$2:AE155),P155:Q903,2,0),\"\")","v":""},null,null,null,null,{"$f":"IFERROR(VLOOKUP(ROWS(AJ$2:$AJ155),O155:Q903,3,0),\"\")","v":""},null,{"$f":"IFERROR(VLOOKUP(ROWS(AL$2:$AL155),N155:Q903,4,0),\"\")","v":""}]
[null,null,null,null,null,null,null,null,null,null,null,null,null,0,0,0,"Edelweiss Select Midcap",13198,null,null,null,null,null,null,null,null,null,null,null,null,{"$f":"IFERROR(VLOOKUP(ROWS($AE$2:AE156),P156:Q904,2,0),\"\")","v":""},null,null,null,null,{"$f":"IFERROR(VLOOKUP(ROWS(AJ$2:$AJ156),O156:Q904,3,0),\"\")","v":""},null,{"$f":"IFERROR(VLOOKUP(ROWS(AL$2:$AL156),N156:Q904,4,0),\"\")","v":""}]
[null,null,null,null,null,null,null,null,null,null,null,null,null,0,0,0,"Edelweiss Select Midcap Direct",15976,null,null,null,null,null,null,null,null,null,null,null,null,{"$f":"IFERROR(VLOOKUP(ROWS($AE$2:AE157),P157:Q905,2,0),\"\")","v":""},null,null,null,null,{"$f":"IFERROR(VLOOKUP(ROWS(AJ$2:$AJ157),O157:Q905,3,0),\"\")","v":""},null,{"$f":"IFERROR(VLOOKUP(ROWS(AL$2:$AL157),N157:Q905,4,0),\"\")","v":""}]
[null,null,null,null,null,null,null,null,null,null,null,null,null,0,0,0,"Escorts Growth",952,null,null,null,null,null,null,null,null,null,null,null,null,{"$f":"IFERROR(VLOOKUP(ROWS($AE$2:AE158),P158:Q906,2,0),\"\")","v":""},null,null,null,null,{"$f":"IFERROR(VLOOKUP(ROWS(AJ$2:$AJ158),O158:Q906,3,0),\"\")","v":""},null,{"$f":"IFERROR(VLOOKUP(ROWS(AL$2:$AL158),N158:Q906,4,0),\"\")","v":""}]
[null,null,null,null,null,null,null,null,null,null,null,null,null,0,0,0,"Escorts Growth Direct",17361,null,null,null,null,null,null,null,null,null,null,null,null,{"$f":"IFERROR(VLOOKUP(ROWS($AE$2:AE159),P159:Q907,2,0),\"\")","v":""},null,null,null,null,{"$f":"IFERROR(VLOOKUP(ROWS(AJ$2:$AJ159),O159:Q907,3,0),\"\")","v":""},null,{"$f":"IFERROR(VLOOKUP(ROWS(AL$2:$AL159),N159:Q907,4,0),\"\")","v":""}]
[null,null,null,null,null,null,null,null,null,null,null,null,null,0,0,0,"Escorts High Yield Equity",4111,null,null,null,null,null,null,null,null,null,null,null,null,{"$f":"IFERROR(VLOOKUP(ROWS($AE$2:AE160),P160:Q908,2,0),\"\")","v":""},null,null,null,null,{"$f":"IFERROR(VLOOKUP(ROWS(AJ$2:$AJ160),O160:Q908,3,0),\"\")","v":""},null,{"$f":"IFERROR(VLOOKUP(ROWS(AL$2:$AL160),N160:Q908,4,0),\"\")","v":""}]
[null,null,null,null,null,null,null,null,null,null,null,null,null,0,0,0,"Escorts High Yield Equity Direct",17363,null,null,null,null,null,null,null,null,null,null,null,null,{"$f":"IFERROR(VLOOKUP(ROWS($AE$2:AE161),P161:Q909,2,0),\"\")","v":""},null,null,null,null,{"$f":"IFERROR(VLOOKUP(ROWS(AJ$2:$AJ161),O161:Q909,3,0),\"\")","v":""},null,{"$f":"IFERROR(VLOOKUP(ROWS(AL$2:$AL161),N161:Q909,4,0),\"\")","v":""}]
[null,null,null,null,null,null,null,null,null,null,null,null,null,0,0,0,"Escorts Infrastructure",5621,null,null,null,null,null,null,null,null,null,null,null,null,{"$f":"IFERROR(VLOOKUP(ROWS($AE$2:AE162),P162:Q910,2,0),\"\")","v":""},null,null,null,null,{"$f":"IFERROR(VLOOKUP(ROWS(AJ$2:$AJ162),O162:Q910,3,0),\"\")","v":""},null,{"$f":"IFERROR(VLOOKUP(ROWS(AL$2:$AL162),N162:Q910,4,0),\"\")","v":""}]
[null,null,null,null,null,null,null,null,null,null,null,null,null,0,0,0,"Escorts Infrastructure Direct",17371,null,null,null,null,null,null,null,null,null,null,null,null,{"$f":"IFERROR(VLOOKUP(ROWS($AE$2:AE163),P163:Q911,2,0),\"\")","v":""},null,null,null,null,{"$f":"IFERROR(VLOOKUP(ROWS(AJ$2:$AJ163),O163:Q911,3,0),\"\")","v":""},null,{"$f":"IFERROR(VLOOKUP(ROWS(AL$2:$AL163),N163:Q911,4,0),\"\")","v":""}]
[null,null,null,null,null,null,null,null,null,null,null,null,null,0,0,0,"Escorts Leading Sectors",8216,null,null,null,null,null,null,null,null,null,null,null,null,{"$f":"IFERROR(VLOOKUP(ROWS($AE$2:AE164),P164:Q912,2,0),\"\")","v":""},null,null,null,null,{"$f":"IFERROR(VLOOKUP(ROWS(AJ$2:$AJ164),O164:Q912,3,0),\"\")","v":""},null,{"$f":"IFERROR(VLOOKUP(ROWS(AL$2:$AL164),N164:Q912,4,0),\"\")","v":""}]
[null,null,null,null,null,null,null,null,null,null,null,null,null,0,0,0,"Escorts Leading Sectors Direct",17373,null,null,null,null,null,null,null,null,null,null,null,null,{"$f":"IFERROR(VLOOKUP(ROWS($AE$2:AE165),P165:Q913,2,0),\"\")","v":""},null,null,null,null,{"$f":"IFERROR(VLOOKUP(ROWS(AJ$2:$AJ165),O165:Q913,3,0),\"\")","v":""},null,{"$f":"IFERROR(VLOOKUP(ROWS(AL$2:$AL165),N165:Q913,4,0),\"\")","v":""}]
[null,null,null,null,null,null,null,null,null,null,null,null,null,0,0,0,"Escorts Power & Energy",8827,null,null,null,null,null,null,null,null,null,null,null,null,{"$f":"IFERROR(VLOOKUP(ROWS($AE$2:AE166),P166:Q914,2,0),\"\")","v":""},null,null,null,null,{"$f":"IFERROR(VLOOKUP(ROWS(AJ$2:$AJ166),O166:Q914,3,0),\"\")","v":""},null,{"$f":"IFERROR(VLOOKUP(ROWS(AL$2:$AL166),N166:Q914,4,0),\"\")","v":""}]
[null,null,null,null,null,null,null,null,null,null,null,null,null,0,0,0,"Escorts Power & Energy Direct",17377,null,null,null,null,null,null,null,null,null,null,null,null,{"$f":"IFERROR(VLOOKUP(ROWS($AE$2:AE167),P167:Q915,2,0),\"\")","v":""},null,null,null,null,{"$f":"IFERROR(VLOOKUP(ROWS(AJ$2:$AJ167),O167:Q915,3,0),\"\")","v":""},null,{"$f":"IFERROR(VLOOKUP(ROWS(AL$2:$AL167),N167:Q915,4,0),\"\")","v":""}]
[null,null,null,null,null,null,null,null,null,null,null,null,null,0,0,0,"Escorts Tax Plan",818,null,null,null,null,null,null,null,null,null,null,null,null,{"$f":"IFERROR(VLOOKUP(ROWS($AE$2:AE168),P168:Q916,2,0),\"\")","v":""},null,null,null,null,{"$f":"IFERROR(VLOOKUP(ROWS(AJ$2:$AJ168),O168:Q916,3,0),\"\")","v":""},null,{"$f":"IFERROR(VLOOKUP(ROWS(AL$2:$AL168),N168:Q916,4,0),\"\")","v":""}]
[null,null,null,null,null,null,null,null,null,null,null,null,null,0,0,0,"Escorts Tax Plan Direct",17381,null,null,null,null,null,null,null,null,null,null,null,null,{"$f":"IFERROR(VLOOKUP(ROWS($AE$2:AE169),P169:Q917,2,0),\"\")","v":""},null,null,null,null,{"$f":"IFERROR(VLOOKUP(ROWS(AJ$2:$AJ169),O169:Q917,3,0),\"\")","v":""},null,{"$f":"IFERROR(VLOOKUP(ROWS(AL$2:$AL169),N169:Q917,4,0),\"\")","v":""}]
[null,null,null,null,null,null,null,null,null,null,null,null,null,0,0,0,"Franklin Asian Equity",6383,null,null,null,null,null,null,null,null,null,null,null,null,{"$f":"IFERROR(VLOOKUP(ROWS($AE$2:AE170),P170:Q918,2,0),\"\")","v":""},null,null,null,null,{"$f":"IFERROR(VLOOKUP(ROWS(AJ$2:$AJ170),O170:Q918,3,0),\"\")","v":""},null,{"$f":"IFERROR(VLOOKUP(ROWS(AL$2:$AL170),N170:Q918,4,0),\"\")","v":""}]
[null,null,null,null,null,null,null,null,null,null,null,null,null,0,0,0,"Franklin Asian Equity Direct",15977,null,null,null,null,null,null,null,null,null,null,null,null,{"$f":"IFERROR(VLOOKUP(ROWS($AE$2:AE171),P171:Q919,2,0),\"\")","v":""},null,null,null,null,{"$f":"IFERROR(VLOOKUP(ROWS(AJ$2:$AJ171),O171:Q919,3,0),\"\")","v":""},null,{"$f":"IFERROR(VLOOKUP(ROWS(AL$2:$AL171),N171:Q919,4,0),\"\")","v":""}]
[null,null,null,null,null,null,null,null,null,null,null,null,null,0,0,0,"Franklin Build India",10563,null,null,null,null,null,null,null,null,null,null,null,null,{"$f":"IFERROR(VLOOKUP(ROWS($AE$2:AE172),P172:Q920,2,0),\"\")","v":""},null,null,null,null,{"$f":"IFERROR(VLOOKUP(ROWS(AJ$2:$AJ172),O172:Q920,3,0),\"\")","v":""},null,{"$f":"IFERROR(VLOOKUP(ROWS(AL$2:$AL172),N172:Q920,4,0),\"\")","v":""}]
[null,null,null,null,null,null,null,null,null,null,null,null,null,0,0,0,"Franklin Build India Direct",15979,null,null,null,null,null,null,null,null,null,null,null,null,{"$f":"IFERROR(VLOOKUP(ROWS($AE$2:AE173),P173:Q921,2,0),\"\")","v":""},null,null,null,null,{"$f":"IFERROR(VLOOKUP(ROWS(AJ$2:$AJ173),O173:Q921,3,0),\"\")","v":""},null,{"$f":"IFERROR(VLOOKUP(ROWS(AL$2:$AL173),N173:Q921,4,0),\"\")","v":""}]
[null,null,null,null,null,null,null,null,null,null,null,null,null,0,1,0,"Franklin India Bluechip",114,null,null,null,null,null,null,null,null,null,null,null,null,{"$f":"IFERROR(VLOOKUP(ROWS($AE$2:AE174),P174:Q922,2,0),\"\")","v":""},null,null,null,null,{"$f":"IFERROR(VLOOKUP(ROWS(AJ$2:$AJ174),O174:Q922,3,0),\"\")","v":""},null,{"$f":"IFERROR(VLOOKUP(ROWS(AL$2:$AL174),N174:Q922,4,0),\"\")","v":""}]
[null,null,null,null,null,null,null,null,null,null,null,null,null,0,2,0,"Franklin India Bluechip Direct",15982,null,null,null,null,null,null,null,null,null,null,null,null,{"$f":"IFERROR(VLOOKUP(ROWS($AE$2:AE175),P175:Q923,2,0),\"\")","v":""},null,null,null,null,{"$f":"IFERROR(VLOOKUP(ROWS(AJ$2:$AJ175),O175:Q923,3,0),\"\")","v":""},null,{"$f":"IFERROR(VLOOKUP(ROWS(AL$2:$AL175),N175:Q923,4,0),\"\")","v":""}]
[null,null,null,null,null,null,null,null,null,null,null,null,null,0,3,0,"Franklin India Flexi Cap",2605,null,null,null,null,null,null,null,null,null,null,null,null,{"$f":"IFERROR(VLOOKUP(ROWS($AE$2:AE176),P176:Q924,2,0),\"\")","v":""},null,null,null,null,{"$f":"IFERROR(VLOOKUP(ROWS(AJ$2:$AJ176),O176:Q924,3,0),\"\")","v":""},null,{"$f":"IFERROR(VLOOKUP(ROWS(AL$2:$AL176),N176:Q924,4,0),\"\")","v":""}]
[null,null,null,null,null,null,null,null,null,null,null,null,null,0,4,0,"Franklin India Flexi Cap Direct",15986,null,null,null,null,null,null,null,null,null,null,null,null,{"$f":"IFERROR(VLOOKUP(ROWS($AE$2:AE177),P177:Q925,2,0),\"\")","v":""},null,null,null,null,{"$f":"IFERROR(VLOOKUP(ROWS(AJ$2:$AJ177),O177:Q925,3,0),\"\")","v":""},null,{"$f":"IFERROR(VLOOKUP(ROWS(AL$2:$AL177),N177:Q925,4,0),\"\")","v":""}]
[null,null,null,null,null,null,null,null,null,null,null,null,null,0,5,0,"Franklin India High Growth Companies",5141,null,null,null,null,null,null,null,null,null,null,null,null,{"$f":"IFERROR(VLOOKUP(ROWS($AE$2:AE178),P178:Q926,2,0),\"\")","v":""},null,null,null,null,{"$f":"IFERROR(VLOOKUP(ROWS(AJ$2:$AJ178),O178:Q926,3,0),\"\")","v":""},null,{"$f":"IFERROR(VLOOKUP(ROWS(AL$2:$AL178),N178:Q926,4,0),\"\")","v":""}]
[null,null,null,null,null,null,null,null,null,null,null,null,null,0,6,0,"Franklin India High Growth Companies Direct",15990,null,null,null,null,null,null,null,null,null,null,null,null,{"$f":"IFERROR(VLOOKUP(ROWS($AE$2:AE179),P179:Q927,2,0),\"\")","v":""},null,null,null,null,{"$f":"IFERROR(VLOOKUP(ROWS(AJ$2:$AJ179),O179:Q927,3,0),\"\")","v":""},null,{"$f":"IFERROR(VLOOKUP(ROWS(AL$2:$AL179),N179:Q927,4,0),\"\")","v":""}]
[null,null,null,null,null,null,null,null,null,null,null,null,null,0,7,0,"Franklin India Index BSE Sensex",2167,null,null,null,null,null,null,null,null,null,null,null,null,{"$f":"IFERROR(VLOOKUP(ROWS($AE$2:AE180),P180:Q928,2,0),\"\")","v":""},null,null,null,null,{"$f":"IFERROR(VLOOKUP(ROWS(AJ$2:$AJ180),O180:Q928,3,0),\"\")","v":""},null,{"$f":"IFERROR(VLOOKUP(ROWS(AL$2:$AL180),N180:Q928,4,0),\"\")","v":""}]
[null,null,null,null,null,null,null,null,null,null,null,null,null,0,8,0,"Franklin India Index BSE Sensex Direct",15993,null,null,null,null,null,null,null,null,null,null,null,null,{"$f":"IFERROR(VLOOKUP(ROWS($AE$2:AE181),P181:Q929,2,0),\"\")","v":""},null,null,null,null,{"$f":"IFERROR(VLOOKUP(ROWS(AJ$2:$AJ181),O181:Q929,3,0),\"\")","v":""},null,{"$f":"IFERROR(VLOOKUP(ROWS(AL$2:$AL181),N181:Q929,4,0),\"\")","v":""}]
[null,null,null,null,null,null,null,null,null,null,null,null,null,0,9,0,"Franklin India Index NSE Nifty",834,null,null,null,null,null,null,null,null,null,null,null,null,{"$f":"IFERROR(VLOOKUP(ROWS($AE$2:AE182),P182:Q930,2,0),\"\")","v":""},null,null,null,null,{"$f":"IFERROR(VLOOKUP(ROWS(AJ$2:$AJ182),O182:Q930,3,0),\"\")","v":""},null,{"$f":"IFERROR(VLOOKUP(ROWS(AL$2:$AL182),N182:Q930,4,0),\"\")","v":""}]
[null,null,null,null,null,null,null,null,null,null,null,null,null,0,10,0,"Franklin India Index NSE Nifty Direct",15996,null,null,null,null,null,null,null,null,null,null,null,null,{"$f":"IFERROR(VLOOKUP(ROWS($AE$2:AE183),P183:Q931,2,0),\"\")","v":""},null,null,null,null,{"$f":"IFERROR(VLOOKUP(ROWS(AJ$2:$AJ183),O183:Q931,3,0),\"\")","v":""},null,{"$f":"IFERROR(VLOOKUP(ROWS(AL$2:$AL183),N183:Q931,4,0),\"\")","v":""}]
[null,null,null,null,null,null,null,null,null,null,null,null,null,0,11,0,"Franklin India Opportunities",2133,null,null,null,null,null,null,null,null,null,null,null,null,{"$f":"IFERROR(VLOOKUP(ROWS($AE$2:AE184),P184:Q932,2,0),\"\")","v":""},null,null,null,null,{"$f":"IFERROR(VLOOKUP(ROWS(AJ$2:$AJ184),O184:Q932,3,0),\"\")","v":""},null,{"$f":"IFERROR(VLOOKUP(ROWS(AL$2:$AL184),N184:Q932,4,0),\"\")","v":""}]
[null,null,null,null,null,null,null,null,null,null,null,null,null,0,12,0,"Franklin India Opportunities Direct",15999,null,null,null,null,null,null,null,null,null,null,null,null,{"$f":"IFERROR(VLOOKUP(ROWS($AE$2:AE185),P185:Q933,2,0),\"\")","v":""},null,null,null,null,{"$f":"IFERROR(VLOOKUP(ROWS(AJ$2:$AJ185),O185:Q933,3,0),\"\")","v":""},null,{"$f":"IFERROR(VLOOKUP(ROWS(AL$2:$AL185),N185:Q933,4,0),\"\")","v":""}]
[null,null,null,null,null,null,null,null,null,null,null,null,null,0,13,0,"Franklin India Prima",115,null,null,null,null,null,null,null,null,null,null,null,null,{"$f":"IFERROR(VLOOKUP(ROWS($AE$2:AE186),P186:Q934,2,0),\"\")","v":""},null,null,null,null,{"$f":"IFERROR(VLOOKUP(ROWS(AJ$2:$AJ186),O186:Q934,3,0),\"\")","v":""},null,{"$f":"IFERROR(VLOOKUP(ROWS(AL$2:$AL186),N186:Q934,4,0),\"\")","v":""}]
[null,null,null,null,null,null,null,null,null,null,null,null,null,0,14,0,"Franklin India Prima Direct",16003,null,null,null,null,null,null,null,null,null,null,null,null,{"$f":"IFERROR(VLOOKUP(ROWS($AE$2:AE187),P187:Q935,2,0),\"\")","v":""},null,null,null,null,{"$f":"IFERROR(VLOOKUP(ROWS(AJ$2:$AJ187),O187:Q935,3,0),\"\")","v":""},null,{"$f":"IFERROR(VLOOKUP(ROWS(AL$2:$AL187),N187:Q935,4,0),\"\")","v":""}]
[null,null,null,null,null,null,null,null,null,null,null,null,null,0,15,0,"Franklin India Prima Plus",116,null,null,null,null,null,null,null,null,null,null,null,null,{"$f":"IFERROR(VLOOKUP(ROWS($AE$2:AE188),P188:Q936,2,0),\"\")","v":""},null,null,null,null,{"$f":"IFERROR(VLOOKUP(ROWS(AJ$2:$AJ188),O188:Q936,3,0),\"\")","v":""},null,{"$f":"IFERROR(VLOOKUP(ROWS(AL$2:$AL188),N188:Q936,4,0),\"\")","v":""}]
[null,null,null,null,null,null,null,null,null,null,null,null,null,0,16,0,"Franklin India Prima Plus Direct",16008,null,null,null,null,null,null,null,null,null,null,null,null,{"$f":"IFERROR(VLOOKUP(ROWS($AE$2:AE189),P189:Q937,2,0),\"\")","v":""},null,null,null,null,{"$f":"IFERROR(VLOOKUP(ROWS(AJ$2:$AJ189),O189:Q937,3,0),\"\")","v":""},null,{"$f":"IFERROR(VLOOKUP(ROWS(AL$2:$AL189),N189:Q937,4,0),\"\")","v":""}]
[null,null,null,null,null,null,null,null,null,null,null,null,null,0,17,0,"Franklin India Smaller Companies",3019,null,null,null,null,null,null,null,null,null,null,null,null,{"$f":"IFERROR(VLOOKUP(ROWS($AE$2:AE190),P190:Q938,2,0),\"\")","v":""},null,null,null,null,{"$f":"IFERROR(VLOOKUP(ROWS(AJ$2:$AJ190),O190:Q938,3,0),\"\")","v":""},null,{"$f":"IFERROR(VLOOKUP(ROWS(AL$2:$AL190),N190:Q938,4,0),\"\")","v":""}]
[null,null,null,null,null,null,null,null,null,null,null,null,null,0,18,0,"Franklin India Smaller Companies Direct",16010,null,null,null,null,null,null,null,null,null,null,null,null,{"$f":"IFERROR(VLOOKUP(ROWS($AE$2:AE191),P191:Q939,2,0),\"\")","v":""},null,null,null,null,{"$f":"IFERROR(VLOOKUP(ROWS(AJ$2:$AJ191),O191:Q939,3,0),\"\")","v":""},null,{"$f":"IFERROR(VLOOKUP(ROWS(AL$2:$AL191),N191:Q939,4,0),\"\")","v":""}]
[null,null,null,null,null,null,null,null,null,null,null,null,null,0,19,0,"Franklin India Taxshield",601,null,null,null,null,null,null,null,null,null,null,null,null,{"$f":"IFERROR(VLOOKUP(ROWS($AE$2:AE192),P192:Q940,2,0),\"\")","v":""},null,null,null,null,{"$f":"IFERROR(VLOOKUP(ROWS(AJ$2:$AJ192),O192:Q940,3,0),\"\")","v":""},null,{"$f":"IFERROR(VLOOKUP(ROWS(AL$2:$AL192),N192:Q940,4,0),\"\")","v":""}]
[null,null,null,null,null,null,null,null,null,null,null,null,null,0,20,0,"Franklin India Taxshield Direct",16014,null,null,null,null,null,null,null,null,null,null,null,null,{"$f":"IFERROR(VLOOKUP(ROWS($AE$2:AE193),P193:Q941,2,0),\"\")","v":""},null,null,null,null,{"$f":"IFERROR(VLOOKUP(ROWS(AJ$2:$AJ193),O193:Q941,3,0),\"\")","v":""},null,{"$f":"IFERROR(VLOOKUP(ROWS(AL$2:$AL193),N193:Q941,4,0),\"\")","v":""}]
[null,null,null,null,null,null,null,null,null,null,null,null,null,0,0,{"$f":"IF(ISNUMBER(SEARCH($H$6,Q194)),MAX($P$1,P193)+1,0)","v":0},"Franklin Infotech",548,null,null,null,null,null,null,null,null,null,null,null,null,{"$f":"IFERROR(VLOOKUP(ROWS($AE$2:AE194),P194:Q942,2,0),\"\")","v":""},null,null,null,null,{"$f":"IFERROR(VLOOKUP(ROWS(AJ$2:$AJ194),O194:Q942,3,0),\"\")","v":""},null,{"$f":"IFERROR(VLOOKUP(ROWS(AL$2:$AL194),N194:Q942,4,0),\"\")","v":""}]
[null,null,null,null,null,null,null,null,null,null,null,null,null,{"$f":"IF(ISNUMBER(SEARCH($H$16,Q195)),MAX($N$1,N194)+1,0)","v":0},{"$f":"IF(ISNUMBER(SEARCH($H$11,Q195)),MAX($O$1,O194)+1,0)","v":0},0,"Franklin Infotech Direct",16018,null,null,null,null,null,null,null,null,null,null,null,null,{"$f":"IFERROR(VLOOKUP(ROWS($AE$2:AE195),P195:Q943,2,0),\"\")","v":""},null,null,null,null,{"$f":"IFERROR(VLOOKUP(ROWS(AJ$2:$AJ195),O195:Q943,3,0),\"\")","v":""},null,{"$f":"IFERROR(VLOOKUP(ROWS(AL$2:$AL195),N195:Q943,4,0),\"\")","v":""}]
[null,null,null,null,null,null,null,null,null,null,null,null,null,0,0,0,"FT India Feeder Franklin US Opportunities",14017,null,null,null,null,null,null,null,null,null,null,null,null,{"$f":"IFERROR(VLOOKUP(ROWS($AE$2:AE196),P196:Q944,2,0),\"\")","v":""},null,null,null,null,{"$f":"IFERROR(VLOOKUP(ROWS(AJ$2:$AJ196),O196:Q944,3,0),\"\")","v":""},null,{"$f":"IFERROR(VLOOKUP(ROWS(AL$2:$AL196),N196:Q944,4,0),\"\")","v":""}]
[null,null,null,null,null,null,null,null,null,null,null,null,null,0,0,0,"FT India Feeder Franklin US Opportunities Direct",16027,null,null,null,null,null,null,null,null,null,null,null,null,{"$f":"IFERROR(VLOOKUP(ROWS($AE$2:AE197),P197:Q945,2,0),\"\")","v":""},null,null,null,null,{"$f":"IFERROR(VLOOKUP(ROWS(AJ$2:$AJ197),O197:Q945,3,0),\"\")","v":""},null,{"$f":"IFERROR(VLOOKUP(ROWS(AL$2:$AL197),N197:Q945,4,0),\"\")","v":""}]
[null,null,null,null,null,null,null,null,null,null,null,null,null,0,0,0,"FT India Life Stage FoF 20s",1978,null,null,null,null,null,null,null,null,null,null,null,null,{"$f":"IFERROR(VLOOKUP(ROWS($AE$2:AE198),P198:Q946,2,0),\"\")","v":""},null,null,null,null,{"$f":"IFERROR(VLOOKUP(ROWS(AJ$2:$AJ198),O198:Q946,3,0),\"\")","v":""},null,{"$f":"IFERROR(VLOOKUP(ROWS(AL$2:$AL198),N198:Q946,4,0),\"\")","v":""}]
[null,null,null,null,null,null,null,null,null,null,null,null,null,0,0,0,"FT India Life Stage FoF 20s Direct",16030,null,null,null,null,null,null,null,null,null,null,null,null,{"$f":"IFERROR(VLOOKUP(ROWS($AE$2:AE199),P199:Q947,2,0),\"\")","v":""},null,null,null,null,{"$f":"IFERROR(VLOOKUP(ROWS(AJ$2:$AJ199),O199:Q947,3,0),\"\")","v":""},null,{"$f":"IFERROR(VLOOKUP(ROWS(AL$2:$AL199),N199:Q947,4,0),\"\")","v":""}]
[null,null,null,null,null,null,null,null,null,null,null,null,null,0,0,0,"Goldman Sachs Banking BeES",2255,null,null,null,null,null,null,null,null,null,null,null,null,{"$f":"IFERROR(VLOOKUP(ROWS($AE$2:AE200),P200:Q948,2,0),\"\")","v":""},null,null,null,null,{"$f":"IFERROR(VLOOKUP(ROWS(AJ$2:$AJ200),O200:Q948,3,0),\"\")","v":""},null,{"$f":"IFERROR(VLOOKUP(ROWS(AL$2:$AL200),N200:Q948,4,0),\"\")","v":""}]
[null,null,null,null,null,null,null,null,null,null,null,null,null,0,0,0,"Goldman Sachs CNX 500",9962,null,null,null,null,null,null,null,null,null,null,null,null,{"$f":"IFERROR(VLOOKUP(ROWS($AE$2:AE201),P201:Q949,2,0),\"\")","v":""},null,null,null,null,{"$f":"IFERROR(VLOOKUP(ROWS(AJ$2:$AJ201),O201:Q949,3,0),\"\")","v":""},null,{"$f":"IFERROR(VLOOKUP(ROWS(AL$2:$AL201),N201:Q949,4,0),\"\")","v":""}]
[null,null,null,null,null,null,null,null,null,null,null,null,null,0,0,0,"Goldman Sachs CNX 500 Direct",16435,null,null,null,null,null,null,null,null,null,null,null,null,{"$f":"IFERROR(VLOOKUP(ROWS($AE$2:AE202),P202:Q950,2,0),\"\")","v":""},null,null,null,null,{"$f":"IFERROR(VLOOKUP(ROWS(AJ$2:$AJ202),O202:Q950,3,0),\"\")","v":""},null,{"$f":"IFERROR(VLOOKUP(ROWS(AL$2:$AL202),N202:Q950,4,0),\"\")","v":""}]
[null,null,null,null,null,null,null,null,null,null,null,null,null,0,0,0,"Goldman Sachs CNX Nifty Shariah BeES",10218,null,null,null,null,null,null,null,null,null,null,null,null,{"$f":"IFERROR(VLOOKUP(ROWS($AE$2:AE203),P203:Q951,2,0),\"\")","v":""},null,null,null,null,{"$f":"IFERROR(VLOOKUP(ROWS(AJ$2:$AJ203),O203:Q951,3,0),\"\")","v":""},null,{"$f":"IFERROR(VLOOKUP(ROWS(AL$2:$AL203),N203:Q951,4,0),\"\")","v":""}]
[null,null,null,null,null,null,null,null,null,null,null,null,null,0,0,0,"Goldman Sachs Hang Seng BeES",10905,null,null,null,null,null,null,null,null,null,null,null,null,{"$f":"IFERROR(VLOOKUP(ROWS($AE$2:AE204),P204:Q952,2,0),\"\")","v":""},null,null,null,null,{"$f":"IFERROR(VLOOKUP(ROWS(AJ$2:$AJ204),O204:Q952,3,0),\"\")","v":""},null,{"$f":"IFERROR(VLOOKUP(ROWS(AL$2:$AL204),N204:Q952,4,0),\"\")","v":""}]
[null,null,null,null,null,null,null,null,null,null,null,null,null,0,0,0,"Goldman Sachs India Equity",15376,null,null,null,null,null,null,null,null,null,null,null,null,{"$f":"IFERROR(VLOOKUP(ROWS($AE$2:AE205),P205:Q953,2,0),\"\")","v":""},null,null,null,null,{"$f":"IFERROR(VLOOKUP(ROWS(AJ$2:$AJ205),O205:Q953,3,0),\"\")","v":""},null,{"$f":"IFERROR(VLOOKUP(ROWS(AL$2:$AL205),N205:Q953,4,0),\"\")","v":""}]
[null,null,null,null,null,null,null,null,null,null,null,null,null,0,0,0,"Goldman Sachs India Equity Direct",16427,null,null,null,null,null,null,null,null,null,null,null,null,{"$f":"IFERROR(VLOOKUP(ROWS($AE$2:AE206),P206:Q954,2,0),\"\")","v":""},null,null,null,null,{"$f":"IFERROR(VLOOKUP(ROWS(AJ$2:$AJ206),O206:Q954,3,0),\"\")","v":""},null,{"$f":"IFERROR(VLOOKUP(ROWS(AL$2:$AL206),N206:Q954,4,0),\"\")","v":""}]
[null,null,null,null,null,null,null,null,null,null,null,null,null,0,0,0,"Goldman Sachs Infra BeES",11650,null,null,null,null,null,null,null,null,null,null,null,null,{"$f":"IFERROR(VLOOKUP(ROWS($AE$2:AE207),P207:Q955,2,0),\"\")","v":""},null,null,null,null,{"$f":"IFERROR(VLOOKUP(ROWS(AJ$2:$AJ207),O207:Q955,3,0),\"\")","v":""},null,{"$f":"IFERROR(VLOOKUP(ROWS(AL$2:$AL207),N207:Q955,4,0),\"\")","v":""}]
[null,null,null,null,null,null,null,null,null,null,null,null,null,0,0,0,"Goldman Sachs Nifty ETS",1171,null,null,null,null,null,null,null,null,null,null,null,null,{"$f":"IFERROR(VLOOKUP(ROWS($AE$2:AE208),P208:Q956,2,0),\"\")","v":""},null,null,null,null,{"$f":"IFERROR(VLOOKUP(ROWS(AJ$2:$AJ208),O208:Q956,3,0),\"\")","v":""},null,{"$f":"IFERROR(VLOOKUP(ROWS(AL$2:$AL208),N208:Q956,4,0),\"\")","v":""}]
[null,null,null,null,null,null,null,null,null,null,null,null,null,0,0,0,"Goldman Sachs Nifty Junior BeES",1545,null,null,null,null,null,null,null,null,null,null,null,null,{"$f":"IFERROR(VLOOKUP(ROWS($AE$2:AE209),P209:Q957,2,0),\"\")","v":""},null,null,null,null,{"$f":"IFERROR(VLOOKUP(ROWS(AJ$2:$AJ209),O209:Q957,3,0),\"\")","v":""},null,{"$f":"IFERROR(VLOOKUP(ROWS(AL$2:$AL209),N209:Q957,4,0),\"\")","v":""}]
[null,null,null,null,null,null,null,null,null,null,null,null,null,0,0,0,"Goldman Sachs PSU Bank BeES",6175,null,null,null,null,null,null,null,null,null,null,null,null,{"$f":"IFERROR(VLOOKUP(ROWS($AE$2:AE210),P210:Q958,2,0),\"\")","v":""},null,null,null,null,{"$f":"IFERROR(VLOOKUP(ROWS(AJ$2:$AJ210),O210:Q958,3,0),\"\")","v":""},null,{"$f":"IFERROR(VLOOKUP(ROWS(AL$2:$AL210),N210:Q958,4,0),\"\")","v":""}]
[null,null,null,null,null,null,null,null,null,null,null,null,null,0,0,0,"HDFC Capital Builder",218,null,null,null,null,null,null,null,null,null,null,null,null,{"$f":"IFERROR(VLOOKUP(ROWS($AE$2:AE211),P211:Q959,2,0),\"\")","v":""},null,null,null,null,{"$f":"IFERROR(VLOOKUP(ROWS(AJ$2:$AJ211),O211:Q959,3,0),\"\")","v":""},null,{"$f":"IFERROR(VLOOKUP(ROWS(AL$2:$AL211),N211:Q959,4,0),\"\")","v":""}]
[null,null,null,null,null,null,null,null,null,null,null,null,null,0,0,0,"HDFC Capital Builder Direct",15989,null,null,null,null,null,null,null,null,null,null,null,null,{"$f":"IFERROR(VLOOKUP(ROWS($AE$2:AE212),P212:Q960,2,0),\"\")","v":""},null,null,null,null,{"$f":"IFERROR(VLOOKUP(ROWS(AJ$2:$AJ212),O212:Q960,3,0),\"\")","v":""},null,{"$f":"IFERROR(VLOOKUP(ROWS(AL$2:$AL212),N212:Q960,4,0),\"\")","v":""}]
[null,null,null,null,null,null,null,null,null,null,null,null,null,0,0,0,"HDFC Core & Satellite",2372,null,null,null,null,null,null,null,null,null,null,null,null,{"$f":"IFERROR(VLOOKUP(ROWS($AE$2:AE213),P213:Q961,2,0),\"\")","v":""},null,null,null,null,{"$f":"IFERROR(VLOOKUP(ROWS(AJ$2:$AJ213),O213:Q961,3,0),\"\")","v":""},null,{"$f":"IFERROR(VLOOKUP(ROWS(AL$2:$AL213),N213:Q961,4,0),\"\")","v":""}]
[null,null,null,null,null,null,null,null,null,null,null,null,null,0,0,0,"HDFC Core & Satellite Direct",16021,null,null,null,null,null,null,null,null,null,null,null,null,{"$f":"IFERROR(VLOOKUP(ROWS($AE$2:AE214),P214:Q962,2,0),\"\")","v":""},null,null,null,null,{"$f":"IFERROR(VLOOKUP(ROWS(AJ$2:$AJ214),O214:Q962,3,0),\"\")","v":""},null,{"$f":"IFERROR(VLOOKUP(ROWS(AL$2:$AL214),N214:Q962,4,0),\"\")","v":""}]
[null,null,null,null,null,null,null,null,null,null,null,null,null,0,0,0,"HDFC Equity",219,null,null,null,null,null,null,null,null,null,null,null,null,{"$f":"IFERROR(VLOOKUP(ROWS($AE$2:AE215),P215:Q963,2,0),\"\")","v":""},null,null,null,null,{"$f":"IFERROR(VLOOKUP(ROWS(AJ$2:$AJ215),O215:Q963,3,0),\"\")","v":""},null,{"$f":"IFERROR(VLOOKUP(ROWS(AL$2:$AL215),N215:Q963,4,0),\"\")","v":""}]
[null,null,null,null,null,null,null,null,null,null,null,null,null,0,0,0,"HDFC Equity Direct",16026,null,null,null,null,null,null,null,null,null,null,null,null,{"$f":"IFERROR(VLOOKUP(ROWS($AE$2:AE216),P216:Q964,2,0),\"\")","v":""},null,null,null,null,{"$f":"IFERROR(VLOOKUP(ROWS(AJ$2:$AJ216),O216:Q964,3,0),\"\")","v":""},null,{"$f":"IFERROR(VLOOKUP(ROWS(AL$2:$AL216),N216:Q964,4,0),\"\")","v":""}]
[null,null,null,null,null,null,null,null,null,null,null,null,null,0,0,0,"HDFC Focused Large Cap",3097,null,null,null,null,null,null,null,null,null,null,null,null,{"$f":"IFERROR(VLOOKUP(ROWS($AE$2:AE217),P217:Q965,2,0),\"\")","v":""},null,null,null,null,{"$f":"IFERROR(VLOOKUP(ROWS(AJ$2:$AJ217),O217:Q965,3,0),\"\")","v":""},null,{"$f":"IFERROR(VLOOKUP(ROWS(AL$2:$AL217),N217:Q965,4,0),\"\")","v":""}]
[null,null,null,null,null,null,null,null,null,null,null,null,null,0,0,0,"HDFC Focused Large Cap Direct",16097,null,null,null,null,null,null,null,null,null,null,null,null,{"$f":"IFERROR(VLOOKUP(ROWS($AE$2:AE218),P218:Q966,2,0),\"\")","v":""},null,null,null,null,{"$f":"IFERROR(VLOOKUP(ROWS(AJ$2:$AJ218),O218:Q966,3,0),\"\")","v":""},null,{"$f":"IFERROR(VLOOKUP(ROWS(AL$2:$AL218),N218:Q966,4,0),\"\")","v":""}]
[null,null,null,null,null,null,null,null,null,null,null,null,null,0,0,0,"HDFC Growth",842,null,null,null,null,null,null,null,null,null,null,null,null,{"$f":"IFERROR(VLOOKUP(ROWS($AE$2:AE219),P219:Q967,2,0),\"\")","v":""},null,null,null,null,{"$f":"IFERROR(VLOOKUP(ROWS(AJ$2:$AJ219),O219:Q967,3,0),\"\")","v":""},null,{"$f":"IFERROR(VLOOKUP(ROWS(AL$2:$AL219),N219:Q967,4,0),\"\")","v":""}]
[null,null,null,null,null,null,null,null,null,null,null,null,null,0,0,0,"HDFC Growth Direct",16055,null,null,null,null,null,null,null,null,null,null,null,null,{"$f":"IFERROR(VLOOKUP(ROWS($AE$2:AE220),P220:Q968,2,0),\"\")","v":""},null,null,null,null,{"$f":"IFERROR(VLOOKUP(ROWS(AJ$2:$AJ220),O220:Q968,3,0),\"\")","v":""},null,{"$f":"IFERROR(VLOOKUP(ROWS(AL$2:$AL220),N220:Q968,4,0),\"\")","v":""}]
[null,null,null,null,null,null,null,null,null,null,null,null,null,0,0,0,"HDFC Index Nifty",1368,null,null,null,null,null,null,null,null,null,null,null,null,{"$f":"IFERROR(VLOOKUP(ROWS($AE$2:AE221),P221:Q969,2,0),\"\")","v":""},null,null,null,null,{"$f":"IFERROR(VLOOKUP(ROWS(AJ$2:$AJ221),O221:Q969,3,0),\"\")","v":""},null,{"$f":"IFERROR(VLOOKUP(ROWS(AL$2:$AL221),N221:Q969,4,0),\"\")","v":""}]
[null,null,null,null,null,null,null,null,null,null,null,null,null,0,0,0,"HDFC Index Nifty Direct",16069,null,null,null,null,null,null,null,null,null,null,null,null,{"$f":"IFERROR(VLOOKUP(ROWS($AE$2:AE222),P222:Q970,2,0),\"\")","v":""},null,null,null,null,{"$f":"IFERROR(VLOOKUP(ROWS(AJ$2:$AJ222),O222:Q970,3,0),\"\")","v":""},null,{"$f":"IFERROR(VLOOKUP(ROWS(AL$2:$AL222),N222:Q970,4,0),\"\")","v":""}]
[null,null,null,null,null,null,null,null,null,null,null,null,null,0,0,0,"HDFC Index Sensex",1370,null,null,null,null,null,null,null,null,null,null,null,null,{"$f":"IFERROR(VLOOKUP(ROWS($AE$2:AE223),P223:Q971,2,0),\"\")","v":""},null,null,null,null,{"$f":"IFERROR(VLOOKUP(ROWS(AJ$2:$AJ223),O223:Q971,3,0),\"\")","v":""},null,{"$f":"IFERROR(VLOOKUP(ROWS(AL$2:$AL223),N223:Q971,4,0),\"\")","v":""}]
[null,null,null,null,null,null,null,null,null,null,null,null,null,0,0,0,"HDFC Index Sensex Direct",16071,null,null,null,null,null,null,null,null,null,null,null,null,{"$f":"IFERROR(VLOOKUP(ROWS($AE$2:AE224),P224:Q972,2,0),\"\")","v":""},null,null,null,null,{"$f":"IFERROR(VLOOKUP(ROWS(AJ$2:$AJ224),O224:Q972,3,0),\"\")","v":""},null,{"$f":"IFERROR(VLOOKUP(ROWS(AL$2:$AL224),N224:Q972,4,0),\"\")","v":""}]
[null,null,null,null,null,null,null,null,null,null,null,null,null,0,0,0,"HDFC Index Sensex Plus",1372,null,null,null,null,null,null,null,null,null,null,null,null,{"$f":"IFERROR(VLOOKUP(ROWS($AE$2:AE225),P225:Q973,2,0),\"\")","v":""},null,null,null,null,{"$f":"IFERROR(VLOOKUP(ROWS(AJ$2:$AJ225),O225:Q973,3,0),\"\")","v":""},null,{"$f":"IFERROR(VLOOKUP(ROWS(AL$2:$AL225),N225:Q973,4,0),\"\")","v":""}]
[null,null,null,null,null,null,null,null,null,null,null,null,null,0,0,0,"HDFC Index Sensex Plus Direct",16073,null,null,null,null,null,null,null,null,null,null,null,null,{"$f":"IFERROR(VLOOKUP(ROWS($AE$2:AE226),P226:Q974,2,0),\"\")","v":""},null,null,null,null,{"$f":"IFERROR(VLOOKUP(ROWS(AJ$2:$AJ226),O226:Q974,3,0),\"\")","v":""},null,{"$f":"IFERROR(VLOOKUP(ROWS(AL$2:$AL226),N226:Q974,4,0),\"\")","v":""}]
[null,null,null,null,null,null,null,null,null,null,null,null,null,0,0,0,"HDFC Infrastructure",6677,null,null,null,null,null,null,null,null,null,null,null,null,{"$f":"IFERROR(VLOOKUP(ROWS($AE$2:AE227),P227:Q975,2,0),\"\")","v":""},null,null,null,null,{"$f":"IFERROR(VLOOKUP(ROWS(AJ$2:$AJ227),O227:Q975,3,0),\"\")","v":""},null,{"$f":"IFERROR(VLOOKUP(ROWS(AL$2:$AL227),N227:Q975,4,0),\"\")","v":""}]
[null,null,null,null,null,null,null,null,null,null,null,null,null,0,0,0,"HDFC Infrastructure Direct",16074,null,null,null,null,null,null,null,null,null,null,null,null,{"$f":"IFERROR(VLOOKUP(ROWS($AE$2:AE228),P228:Q976,2,0),\"\")","v":""},null,null,null,null,{"$f":"IFERROR(VLOOKUP(ROWS(AJ$2:$AJ228),O228:Q976,3,0),\"\")","v":""},null,{"$f":"IFERROR(VLOOKUP(ROWS(AL$2:$AL228),N228:Q976,4,0),\"\")","v":""}]
[null,null,null,null,null,null,null,null,null,null,null,null,null,0,0,0,"HDFC LT Advantage",915,null,null,null,null,null,null,null,null,null,null,null,null,{"$f":"IFERROR(VLOOKUP(ROWS($AE$2:AE229),P229:Q977,2,0),\"\")","v":""},null,null,null,null,{"$f":"IFERROR(VLOOKUP(ROWS(AJ$2:$AJ229),O229:Q977,3,0),\"\")","v":""},null,{"$f":"IFERROR(VLOOKUP(ROWS(AL$2:$AL229),N229:Q977,4,0),\"\")","v":""}]
[null,null,null,null,null,null,null,null,null,null,null,null,null,0,0,0,"HDFC LT Advantage Direct",16090,null,null,null,null,null,null,null,null,null,null,null,null,{"$f":"IFERROR(VLOOKUP(ROWS($AE$2:AE230),P230:Q978,2,0),\"\")","v":""},null,null,null,null,{"$f":"IFERROR(VLOOKUP(ROWS(AJ$2:$AJ230),O230:Q978,3,0),\"\")","v":""},null,{"$f":"IFERROR(VLOOKUP(ROWS(AL$2:$AL230),N230:Q978,4,0),\"\")","v":""}]
[null,null,null,null,null,null,null,null,null,null,null,null,null,0,0,0,"HDFC Mid-Cap Opportunities",5067,null,null,null,null,null,null,null,null,null,null,null,null,{"$f":"IFERROR(VLOOKUP(ROWS($AE$2:AE231),P231:Q979,2,0),\"\")","v":""},null,null,null,null,{"$f":"IFERROR(VLOOKUP(ROWS(AJ$2:$AJ231),O231:Q979,3,0),\"\")","v":""},null,{"$f":"IFERROR(VLOOKUP(ROWS(AL$2:$AL231),N231:Q979,4,0),\"\")","v":""}]
[null,null,null,null,null,null,null,null,null,null,null,null,null,0,0,0,"HDFC Mid-Cap Opportunities Direct",16114,null,null,null,null,null,null,null,null,null,null,null,null,{"$f":"IFERROR(VLOOKUP(ROWS($AE$2:AE232),P232:Q980,2,0),\"\")","v":""},null,null,null,null,{"$f":"IFERROR(VLOOKUP(ROWS(AJ$2:$AJ232),O232:Q980,3,0),\"\")","v":""},null,{"$f":"IFERROR(VLOOKUP(ROWS(AL$2:$AL232),N232:Q980,4,0),\"\")","v":""}]
[null,null,null,null,null,null,null,null,null,null,null,null,null,0,0,0,"HDFC Premier Multi-Cap",2668,null,null,null,null,null,null,null,null,null,null,null,null,{"$f":"IFERROR(VLOOKUP(ROWS($AE$2:AE233),P233:Q981,2,0),\"\")","v":""},null,null,null,null,{"$f":"IFERROR(VLOOKUP(ROWS(AJ$2:$AJ233),O233:Q981,3,0),\"\")","v":""},null,{"$f":"IFERROR(VLOOKUP(ROWS(AL$2:$AL233),N233:Q981,4,0),\"\")","v":""}]
[null,null,null,null,null,null,null,null,null,null,null,null,null,0,0,0,"HDFC Premier Multi-Cap Direct",16132,null,null,null,null,null,null,null,null,null,null,null,null,{"$f":"IFERROR(VLOOKUP(ROWS($AE$2:AE234),P234:Q982,2,0),\"\")","v":""},null,null,null,null,{"$f":"IFERROR(VLOOKUP(ROWS(AJ$2:$AJ234),O234:Q982,3,0),\"\")","v":""},null,{"$f":"IFERROR(VLOOKUP(ROWS(AL$2:$AL234),N234:Q982,4,0),\"\")","v":""}]
[null,null,null,null,null,null,null,null,null,null,null,null,null,0,0,0,"HDFC Taxsaver",854,null,null,null,null,null,null,null,null,null,null,null,null,{"$f":"IFERROR(VLOOKUP(ROWS($AE$2:AE235),P235:Q983,2,0),\"\")","v":""},null,null,null,null,{"$f":"IFERROR(VLOOKUP(ROWS(AJ$2:$AJ235),O235:Q983,3,0),\"\")","v":""},null,{"$f":"IFERROR(VLOOKUP(ROWS(AL$2:$AL235),N235:Q983,4,0),\"\")","v":""}]
[null,null,null,null,null,null,null,null,null,null,null,null,null,0,0,0,"HDFC Taxsaver Direct",16160,null,null,null,null,null,null,null,null,null,null,null,null,{"$f":"IFERROR(VLOOKUP(ROWS($AE$2:AE236),P236:Q984,2,0),\"\")","v":""},null,null,null,null,{"$f":"IFERROR(VLOOKUP(ROWS(AJ$2:$AJ236),O236:Q984,3,0),\"\")","v":""},null,{"$f":"IFERROR(VLOOKUP(ROWS(AL$2:$AL236),N236:Q984,4,0),\"\")","v":""}]
[null,null,null,null,null,null,null,null,null,null,null,null,null,0,0,0,"HDFC Top 200",104,null,null,null,null,null,null,null,null,null,null,null,null,{"$f":"IFERROR(VLOOKUP(ROWS($AE$2:AE237),P237:Q985,2,0),\"\")","v":""},null,null,null,null,{"$f":"IFERROR(VLOOKUP(ROWS(AJ$2:$AJ237),O237:Q985,3,0),\"\")","v":""},null,{"$f":"IFERROR(VLOOKUP(ROWS(AL$2:$AL237),N237:Q985,4,0),\"\")","v":""}]
[null,null,null,null,null,null,null,null,null,null,null,null,null,0,0,0,"HDFC Top 200 Direct",16164,null,null,null,null,null,null,null,null,null,null,null,null,{"$f":"IFERROR(VLOOKUP(ROWS($AE$2:AE238),P238:Q986,2,0),\"\")","v":""},null,null,null,null,{"$f":"IFERROR(VLOOKUP(ROWS(AJ$2:$AJ238),O238:Q986,3,0),\"\")","v":""},null,{"$f":"IFERROR(VLOOKUP(ROWS(AL$2:$AL238),N238:Q986,4,0),\"\")","v":""}]
[null,null,null,null,null,null,null,null,null,null,null,null,null,0,0,0,"HSBC Brazil",12632,null,null,null,null,null,null,null,null,null,null,null,null,{"$f":"IFERROR(VLOOKUP(ROWS($AE$2:AE239),P239:Q987,2,0),\"\")","v":""},null,null,null,null,{"$f":"IFERROR(VLOOKUP(ROWS(AJ$2:$AJ239),O239:Q987,3,0),\"\")","v":""},null,{"$f":"IFERROR(VLOOKUP(ROWS(AL$2:$AL239),N239:Q987,4,0),\"\")","v":""}]
[null,null,null,null,null,null,null,null,null,null,null,null,null,0,0,0,"HSBC Brazil Direct",17042,null,null,null,null,null,null,null,null,null,null,null,null,{"$f":"IFERROR(VLOOKUP(ROWS($AE$2:AE240),P240:Q988,2,0),\"\")","v":""},null,null,null,null,{"$f":"IFERROR(VLOOKUP(ROWS(AJ$2:$AJ240),O240:Q988,3,0),\"\")","v":""},null,{"$f":"IFERROR(VLOOKUP(ROWS(AL$2:$AL240),N240:Q988,4,0),\"\")","v":""}]
[null,null,null,null,null,null,null,null,null,null,null,null,null,0,0,0,"HSBC Brazil Direct",17043,null,null,null,null,null,null,null,null,null,null,null,null,{"$f":"IFERROR(VLOOKUP(ROWS($AE$2:AE241),P241:Q989,2,0),\"\")","v":""},null,null,null,null,{"$f":"IFERROR(VLOOKUP(ROWS(AJ$2:$AJ241),O241:Q989,3,0),\"\")","v":""},null,{"$f":"IFERROR(VLOOKUP(ROWS(AL$2:$AL241),N241:Q989,4,0),\"\")","v":""}]
[null,null,null,null,null,null,null,null,null,null,null,null,null,0,0,0,"HSBC Dynamic",5562,null,null,null,null,null,null,null,null,null,null,null,null,{"$f":"IFERROR(VLOOKUP(ROWS($AE$2:AE242),P242:Q990,2,0),\"\")","v":""},null,null,null,null,{"$f":"IFERROR(VLOOKUP(ROWS(AJ$2:$AJ242),O242:Q990,3,0),\"\")","v":""},null,{"$f":"IFERROR(VLOOKUP(ROWS(AL$2:$AL242),N242:Q990,4,0),\"\")","v":""}]
[null,null,null,null,null,null,null,null,null,null,null,null,null,0,0,0,"HSBC Dynamic Direct",17388,null,null,null,null,null,null,null,null,null,null,null,null,{"$f":"IFERROR(VLOOKUP(ROWS($AE$2:AE243),P243:Q991,2,0),\"\")","v":""},null,null,null,null,{"$f":"IFERROR(VLOOKUP(ROWS(AJ$2:$AJ243),O243:Q991,3,0),\"\")","v":""},null,{"$f":"IFERROR(VLOOKUP(ROWS(AL$2:$AL243),N243:Q991,4,0),\"\")","v":""}]
[null,null,null,null,null,null,null,null,null,null,null,null,null,0,0,0,"HSBC Emerging Markets",6774,null,null,null,null,null,null,null,null,null,null,null,null,{"$f":"IFERROR(VLOOKUP(ROWS($AE$2:AE244),P244:Q992,2,0),\"\")","v":""},null,null,null,null,{"$f":"IFERROR(VLOOKUP(ROWS(AJ$2:$AJ244),O244:Q992,3,0),\"\")","v":""},null,{"$f":"IFERROR(VLOOKUP(ROWS(AL$2:$AL244),N244:Q992,4,0),\"\")","v":""}]
[null,null,null,null,null,null,null,null,null,null,null,null,null,0,0,0,"HSBC Emerging Markets Direct",17037,null,null,null,null,null,null,null,null,null,null,null,null,{"$f":"IFERROR(VLOOKUP(ROWS($AE$2:AE245),P245:Q993,2,0),\"\")","v":""},null,null,null,null,{"$f":"IFERROR(VLOOKUP(ROWS(AJ$2:$AJ245),O245:Q993,3,0),\"\")","v":""},null,{"$f":"IFERROR(VLOOKUP(ROWS(AL$2:$AL245),N245:Q993,4,0),\"\")","v":""}]
[null,null,null,null,null,null,null,null,null,null,null,null,null,0,0,0,"HSBC Equity",1481,null,null,null,null,null,null,null,null,null,null,null,null,{"$f":"IFERROR(VLOOKUP(ROWS($AE$2:AE246),P246:Q994,2,0),\"\")","v":""},null,null,null,null,{"$f":"IFERROR(VLOOKUP(ROWS(AJ$2:$AJ246),O246:Q994,3,0),\"\")","v":""},null,{"$f":"IFERROR(VLOOKUP(ROWS(AL$2:$AL246),N246:Q994,4,0),\"\")","v":""}]
[null,null,null,null,null,null,null,null,null,null,null,null,null,0,0,0,"HSBC Equity Direct",16289,null,null,null,null,null,null,null,null,null,null,null,null,{"$f":"IFERROR(VLOOKUP(ROWS($AE$2:AE247),P247:Q995,2,0),\"\")","v":""},null,null,null,null,{"$f":"IFERROR(VLOOKUP(ROWS(AJ$2:$AJ247),O247:Q995,3,0),\"\")","v":""},null,{"$f":"IFERROR(VLOOKUP(ROWS(AL$2:$AL247),N247:Q995,4,0),\"\")","v":""}]
[null,null,null,null,null,null,null,null,null,null,null,null,null,0,0,0,"HSBC India Opportunities",2072,null,null,null,null,null,null,null,null,null,null,null,null,{"$f":"IFERROR(VLOOKUP(ROWS($AE$2:AE248),P248:Q996,2,0),\"\")","v":""},null,null,null,null,{"$f":"IFERROR(VLOOKUP(ROWS(AJ$2:$AJ248),O248:Q996,3,0),\"\")","v":""},null,{"$f":"IFERROR(VLOOKUP(ROWS(AL$2:$AL248),N248:Q996,4,0),\"\")","v":""}]
[null,null,null,null,null,null,null,null,null,null,null,null,null,0,0,0,"HSBC India Opportunities Direct",16320,null,null,null,null,null,null,null,null,null,null,null,null,{"$f":"IFERROR(VLOOKUP(ROWS($AE$2:AE249),P249:Q997,2,0),\"\")","v":""},null,null,null,null,{"$f":"IFERROR(VLOOKUP(ROWS(AJ$2:$AJ249),O249:Q997,3,0),\"\")","v":""},null,{"$f":"IFERROR(VLOOKUP(ROWS(AL$2:$AL249),N249:Q997,4,0),\"\")","v":""}]
[null,null,null,null,null,null,null,null,null,null,null,null,null,0,0,0,"HSBC Midcap Equity",2736,null,null,null,null,null,null,null,null,null,null,null,null,{"$f":"IFERROR(VLOOKUP(ROWS($AE$2:AE250),P250:Q998,2,0),\"\")","v":""},null,null,null,null,{"$f":"IFERROR(VLOOKUP(ROWS(AJ$2:$AJ250),O250:Q998,3,0),\"\")","v":""},null,{"$f":"IFERROR(VLOOKUP(ROWS(AL$2:$AL250),N250:Q998,4,0),\"\")","v":""}]
[null,null,null,null,null,null,null,null,null,null,null,null,null,0,0,0,"HSBC Midcap Equity Direct",16325,null,null,null,null,null,null,null,null,null,null,null,null,{"$f":"IFERROR(VLOOKUP(ROWS($AE$2:AE251),P251:Q999,2,0),\"\")","v":""},null,null,null,null,{"$f":"IFERROR(VLOOKUP(ROWS(AJ$2:$AJ251),O251:Q999,3,0),\"\")","v":""},null,{"$f":"IFERROR(VLOOKUP(ROWS(AL$2:$AL251),N251:Q999,4,0),\"\")","v":""}]
[null,null,null,null,null,null,null,null,null,null,null,null,null,0,0,0,"HSBC Progressive Themes",3087,null,null,null,null,null,null,null,null,null,null,null,null,{"$f":"IFERROR(VLOOKUP(ROWS($AE$2:AE252),P252:Q1000,2,0),\"\")","v":""},null,null,null,null,{"$f":"IFERROR(VLOOKUP(ROWS(AJ$2:$AJ252),O252:Q1000,3,0),\"\")","v":""},null,{"$f":"IFERROR(VLOOKUP(ROWS(AL$2:$AL252),N252:Q1000,4,0),\"\")","v":""}]
[null,null,null,null,null,null,null,null,null,null,null,null,null,0,0,0,"HSBC Progressive Themes Direct",16330,null,null,null,null,null,null,null,null,null,null,null,null,{"$f":"IFERROR(VLOOKUP(ROWS($AE$2:AE253),P253:Q1001,2,0),\"\")","v":""},null,null,null,null,{"$f":"IFERROR(VLOOKUP(ROWS(AJ$2:$AJ253),O253:Q1001,3,0),\"\")","v":""},null,{"$f":"IFERROR(VLOOKUP(ROWS(AL$2:$AL253),N253:Q1001,4,0),\"\")","v":""}]
[null,null,null,null,null,null,null,null,null,null,null,null,null,0,0,0,"HSBC Small Cap",6776,null,null,null,null,null,null,null,null,null,null,null,null,{"$f":"IFERROR(VLOOKUP(ROWS($AE$2:AE254),P254:Q1002,2,0),\"\")","v":""},null,null,null,null,{"$f":"IFERROR(VLOOKUP(ROWS(AJ$2:$AJ254),O254:Q1002,3,0),\"\")","v":""},null,{"$f":"IFERROR(VLOOKUP(ROWS(AL$2:$AL254),N254:Q1002,4,0),\"\")","v":""}]
[null,null,null,null,null,null,null,null,null,null,null,null,null,0,0,0,"HSBC Small Cap Direct",16282,null,null,null,null,null,null,null,null,null,null,null,null,{"$f":"IFERROR(VLOOKUP(ROWS($AE$2:AE255),P255:Q1003,2,0),\"\")","v":""},null,null,null,null,{"$f":"IFERROR(VLOOKUP(ROWS(AJ$2:$AJ255),O255:Q1003,3,0),\"\")","v":""},null,{"$f":"IFERROR(VLOOKUP(ROWS(AL$2:$AL255),N255:Q1003,4,0),\"\")","v":""}]
[null,null,null,null,null,null,null,null,null,null,null,null,null,0,0,0,"HSBC Tax Saver Equity",3927,null,null,null,null,null,null,null,null,null,null,null,null,{"$f":"IFERROR(VLOOKUP(ROWS($AE$2:AE256),P256:Q1004,2,0),\"\")","v":""},null,null,null,null,{"$f":"IFERROR(VLOOKUP(ROWS(AJ$2:$AJ256),O256:Q1004,3,0),\"\")","v":""},null,{"$f":"IFERROR(VLOOKUP(ROWS(AL$2:$AL256),N256:Q1004,4,0),\"\")","v":""}]
[null,null,null,null,null,null,null,null,null,null,null,null,null,0,0,0,"HSBC Tax Saver Equity Direct",16332,null,null,null,null,null,null,null,null,null,null,null,null,{"$f":"IFERROR(VLOOKUP(ROWS($AE$2:AE257),P257:Q1005,2,0),\"\")","v":""},null,null,null,null,{"$f":"IFERROR(VLOOKUP(ROWS(AJ$2:$AJ257),O257:Q1005,3,0),\"\")","v":""},null,{"$f":"IFERROR(VLOOKUP(ROWS(AL$2:$AL257),N257:Q1005,4,0),\"\")","v":""}]
[null,null,null,null,null,null,null,null,null,null,null,null,null,0,0,{"$f":"IF(ISNUMBER(SEARCH($H$6,Q258)),MAX($P$1,P257)+1,0)","v":0},"HSBC Unique Opportunities",4254,null,null,null,null,null,null,null,null,null,null,null,null,{"$f":"IFERROR(VLOOKUP(ROWS($AE$2:AE258),P258:Q1006,2,0),\"\")","v":""},null,null,null,null,{"$f":"IFERROR(VLOOKUP(ROWS(AJ$2:$AJ258),O258:Q1006,3,0),\"\")","v":""},null,{"$f":"IFERROR(VLOOKUP(ROWS(AL$2:$AL258),N258:Q1006,4,0),\"\")","v":""}]
[null,null,null,null,null,null,null,null,null,null,null,null,null,{"$f":"IF(ISNUMBER(SEARCH($H$16,Q259)),MAX($N$1,N258)+1,0)","v":0},{"$f":"IF(ISNUMBER(SEARCH($H$11,Q259)),MAX($O$1,O258)+1,0)","v":0},0,"HSBC Unique Opportunities Direct",17698,null,null,null,null,null,null,null,null,null,null,null,null,{"$f":"IFERROR(VLOOKUP(ROWS($AE$2:AE259),P259:Q1007,2,0),\"\")","v":""},null,null,null,null,{"$f":"IFERROR(VLOOKUP(ROWS(AJ$2:$AJ259),O259:Q1007,3,0),\"\")","v":""},null,{"$f":"IFERROR(VLOOKUP(ROWS(AL$2:$AL259),N259:Q1007,4,0),\"\")","v":""}]
[null,null,null,null,null,null,null,null,null,null,null,null,null,0,0,0,"ICICI Prudential Advisor-Very Aggressive Reg",1936,null,null,null,null,null,null,null,null,null,null,null,null,{"$f":"IFERROR(VLOOKUP(ROWS($AE$2:AE260),P260:Q1008,2,0),\"\")","v":""},null,null,null,null,{"$f":"IFERROR(VLOOKUP(ROWS(AJ$2:$AJ260),O260:Q1008,3,0),\"\")","v":""},null,{"$f":"IFERROR(VLOOKUP(ROWS(AL$2:$AL260),N260:Q1008,4,0),\"\")","v":""}]
[null,null,null,null,null,null,null,null,null,null,null,null,null,0,0,0,"ICICI Prudential Banking and Financial Services Direct",15936,null,null,null,null,null,null,null,null,null,null,null,null,{"$f":"IFERROR(VLOOKUP(ROWS($AE$2:AE261),P261:Q1009,2,0),\"\")","v":""},null,null,null,null,{"$f":"IFERROR(VLOOKUP(ROWS(AJ$2:$AJ261),O261:Q1009,3,0),\"\")","v":""},null,{"$f":"IFERROR(VLOOKUP(ROWS(AL$2:$AL261),N261:Q1009,4,0),\"\")","v":""}]
[null,null,null,null,null,null,null,null,null,null,null,null,null,0,0,0,"ICICI Prudential Banking and Financial Services Reg",8293,null,null,null,null,null,null,null,null,null,null,null,null,{"$f":"IFERROR(VLOOKUP(ROWS($AE$2:AE262),P262:Q1010,2,0),\"\")","v":""},null,null,null,null,{"$f":"IFERROR(VLOOKUP(ROWS(AJ$2:$AJ262),O262:Q1010,3,0),\"\")","v":""},null,{"$f":"IFERROR(VLOOKUP(ROWS(AL$2:$AL262),N262:Q1010,4,0),\"\")","v":""}]
[null,null,null,null,null,null,null,null,null,null,null,null,null,0,0,0,"ICICI Prudential CNX 100 ETF",20933,null,null,null,null,null,null,null,null,null,null,null,null,{"$f":"IFERROR(VLOOKUP(ROWS($AE$2:AE263),P263:Q1011,2,0),\"\")","v":""},null,null,null,null,{"$f":"IFERROR(VLOOKUP(ROWS(AJ$2:$AJ263),O263:Q1011,3,0),\"\")","v":""},null,{"$f":"IFERROR(VLOOKUP(ROWS(AL$2:$AL263),N263:Q1011,4,0),\"\")","v":""}]
[null,null,null,null,null,null,null,null,null,null,null,null,null,0,0,0,"ICICI Prudential Discovery Direct",15822,null,null,null,null,null,null,null,null,null,null,null,null,{"$f":"IFERROR(VLOOKUP(ROWS($AE$2:AE264),P264:Q1012,2,0),\"\")","v":""},null,null,null,null,{"$f":"IFERROR(VLOOKUP(ROWS(AJ$2:$AJ264),O264:Q1012,3,0),\"\")","v":""},null,{"$f":"IFERROR(VLOOKUP(ROWS(AL$2:$AL264),N264:Q1012,4,0),\"\")","v":""}]
[null,null,null,null,null,null,null,null,null,null,null,null,null,0,0,0,"ICICI Prudential Discovery Inst I",3278,null,null,null,null,null,null,null,null,null,null,null,null,{"$f":"IFERROR(VLOOKUP(ROWS($AE$2:AE265),P265:Q1013,2,0),\"\")","v":""},null,null,null,null,{"$f":"IFERROR(VLOOKUP(ROWS(AJ$2:$AJ265),O265:Q1013,3,0),\"\")","v":""},null,{"$f":"IFERROR(VLOOKUP(ROWS(AL$2:$AL265),N265:Q1013,4,0),\"\")","v":""}]
[null,null,null,null,null,null,null,null,null,null,null,null,null,0,0,0,"ICICI Prudential Discovery Reg",2310,null,null,null,null,null,null,null,null,null,null,null,null,{"$f":"IFERROR(VLOOKUP(ROWS($AE$2:AE266),P266:Q1014,2,0),\"\")","v":""},null,null,null,null,{"$f":"IFERROR(VLOOKUP(ROWS(AJ$2:$AJ266),O266:Q1014,3,0),\"\")","v":""},null,{"$f":"IFERROR(VLOOKUP(ROWS(AL$2:$AL266),N266:Q1014,4,0),\"\")","v":""}]
[null,null,null,null,null,null,null,null,null,null,null,null,null,0,0,0,"ICICI Prudential Dynamic Direct",15945,null,null,null,null,null,null,null,null,null,null,null,null,{"$f":"IFERROR(VLOOKUP(ROWS($AE$2:AE267),P267:Q1015,2,0),\"\")","v":""},null,null,null,null,{"$f":"IFERROR(VLOOKUP(ROWS(AJ$2:$AJ267),O267:Q1015,3,0),\"\")","v":""},null,{"$f":"IFERROR(VLOOKUP(ROWS(AL$2:$AL267),N267:Q1015,4,0),\"\")","v":""}]
[null,null,null,null,null,null,null,null,null,null,null,null,null,0,0,0,"ICICI Prudential Dynamic Inst",12753,null,null,null,null,null,null,null,null,null,null,null,null,{"$f":"IFERROR(VLOOKUP(ROWS($AE$2:AE268),P268:Q1016,2,0),\"\")","v":""},null,null,null,null,{"$f":"IFERROR(VLOOKUP(ROWS(AJ$2:$AJ268),O268:Q1016,3,0),\"\")","v":""},null,{"$f":"IFERROR(VLOOKUP(ROWS(AL$2:$AL268),N268:Q1016,4,0),\"\")","v":""}]
[null,null,null,null,null,null,null,null,null,null,null,null,null,0,0,0,"ICICI Prudential Dynamic Inst I",4437,null,null,null,null,null,null,null,null,null,null,null,null,{"$f":"IFERROR(VLOOKUP(ROWS($AE$2:AE269),P269:Q1017,2,0),\"\")","v":""},null,null,null,null,{"$f":"IFERROR(VLOOKUP(ROWS(AJ$2:$AJ269),O269:Q1017,3,0),\"\")","v":""},null,{"$f":"IFERROR(VLOOKUP(ROWS(AL$2:$AL269),N269:Q1017,4,0),\"\")","v":""}]
[null,null,null,null,null,null,null,null,null,null,null,null,null,0,0,0,"ICICI Prudential Dynamic Reg",1471,null,null,null,null,null,null,null,null,null,null,null,null,{"$f":"IFERROR(VLOOKUP(ROWS($AE$2:AE270),P270:Q1018,2,0),\"\")","v":""},null,null,null,null,{"$f":"IFERROR(VLOOKUP(ROWS(AJ$2:$AJ270),O270:Q1018,3,0),\"\")","v":""},null,{"$f":"IFERROR(VLOOKUP(ROWS(AL$2:$AL270),N270:Q1018,4,0),\"\")","v":""}]
[null,null,null,null,null,null,null,null,null,null,null,null,null,0,0,0,"ICICI Prudential Exports and Other Services Direct",15859,null,null,null,null,null,null,null,null,null,null,null,null,{"$f":"IFERROR(VLOOKUP(ROWS($AE$2:AE271),P271:Q1019,2,0),\"\")","v":""},null,null,null,null,{"$f":"IFERROR(VLOOKUP(ROWS(AJ$2:$AJ271),O271:Q1019,3,0),\"\")","v":""},null,{"$f":"IFERROR(VLOOKUP(ROWS(AL$2:$AL271),N271:Q1019,4,0),\"\")","v":""}]
[null,null,null,null,null,null,null,null,null,null,null,null,null,0,0,0,"ICICI Prudential Exports and Other Services Reg",2968,null,null,null,null,null,null,null,null,null,null,null,null,{"$f":"IFERROR(VLOOKUP(ROWS($AE$2:AE272),P272:Q1020,2,0),\"\")","v":""},null,null,null,null,{"$f":"IFERROR(VLOOKUP(ROWS(AJ$2:$AJ272),O272:Q1020,3,0),\"\")","v":""},null,{"$f":"IFERROR(VLOOKUP(ROWS(AL$2:$AL272),N272:Q1020,4,0),\"\")","v":""}]
[null,null,null,null,null,null,null,null,null,null,null,null,null,0,0,0,"ICICI Prudential FMCG Direct",15836,null,null,null,null,null,null,null,null,null,null,null,null,{"$f":"IFERROR(VLOOKUP(ROWS($AE$2:AE273),P273:Q1021,2,0),\"\")","v":""},null,null,null,null,{"$f":"IFERROR(VLOOKUP(ROWS(AJ$2:$AJ273),O273:Q1021,3,0),\"\")","v":""},null,{"$f":"IFERROR(VLOOKUP(ROWS(AL$2:$AL273),N273:Q1021,4,0),\"\")","v":""}]
[null,null,null,null,null,null,null,null,null,null,null,null,null,0,0,0,"ICICI Prudential FMCG Reg",591,null,null,null,null,null,null,null,null,null,null,null,null,{"$f":"IFERROR(VLOOKUP(ROWS($AE$2:AE274),P274:Q1022,2,0),\"\")","v":""},null,null,null,null,{"$f":"IFERROR(VLOOKUP(ROWS(AJ$2:$AJ274),O274:Q1022,3,0),\"\")","v":""},null,{"$f":"IFERROR(VLOOKUP(ROWS(AL$2:$AL274),N274:Q1022,4,0),\"\")","v":""}]
[null,null,null,null,null,null,null,null,null,null,null,null,null,0,0,0,"ICICI Prudential Focused Bluechip Equity Direct",15841,null,null,null,null,null,null,null,null,null,null,null,null,{"$f":"IFERROR(VLOOKUP(ROWS($AE$2:AE275),P275:Q1023,2,0),\"\")","v":""},null,null,null,null,{"$f":"IFERROR(VLOOKUP(ROWS(AJ$2:$AJ275),O275:Q1023,3,0),\"\")","v":""},null,{"$f":"IFERROR(VLOOKUP(ROWS(AL$2:$AL275),N275:Q1023,4,0),\"\")","v":""}]
[null,null,null,null,null,null,null,null,null,null,null,null,null,0,0,0,"ICICI Prudential Focused Bluechip Equity Inst I",7519,null,null,null,null,null,null,null,null,null,null,null,null,{"$f":"IFERROR(VLOOKUP(ROWS($AE$2:AE276),P276:Q1024,2,0),\"\")","v":""},null,null,null,null,{"$f":"IFERROR(VLOOKUP(ROWS(AJ$2:$AJ276),O276:Q1024,3,0),\"\")","v":""},null,{"$f":"IFERROR(VLOOKUP(ROWS(AL$2:$AL276),N276:Q1024,4,0),\"\")","v":""}]
[null,null,null,null,null,null,null,null,null,null,null,null,null,0,0,0,"ICICI Prudential Focused Bluechip Equity Reg",7517,null,null,null,null,null,null,null,null,null,null,null,null,{"$f":"IFERROR(VLOOKUP(ROWS($AE$2:AE277),P277:Q1025,2,0),\"\")","v":""},null,null,null,null,{"$f":"IFERROR(VLOOKUP(ROWS(AJ$2:$AJ277),O277:Q1025,3,0),\"\")","v":""},null,{"$f":"IFERROR(VLOOKUP(ROWS(AL$2:$AL277),N277:Q1025,4,0),\"\")","v":""}]
[null,null,null,null,null,null,null,null,null,null,null,null,null,0,0,0,"ICICI Prudential Global Stable Equity Direct",20857,null,null,null,null,null,null,null,null,null,null,null,null,{"$f":"IFERROR(VLOOKUP(ROWS($AE$2:AE278),P278:Q1026,2,0),\"\")","v":""},null,null,null,null,{"$f":"IFERROR(VLOOKUP(ROWS(AJ$2:$AJ278),O278:Q1026,3,0),\"\")","v":""},null,{"$f":"IFERROR(VLOOKUP(ROWS(AL$2:$AL278),N278:Q1026,4,0),\"\")","v":""}]
[null,null,null,null,null,null,null,null,null,null,null,null,null,0,0,0,"ICICI Prudential Global Stable Equity Reg",20855,null,null,null,null,null,null,null,null,null,null,null,null,{"$f":"IFERROR(VLOOKUP(ROWS($AE$2:AE279),P279:Q1027,2,0),\"\")","v":""},null,null,null,null,{"$f":"IFERROR(VLOOKUP(ROWS(AJ$2:$AJ279),O279:Q1027,3,0),\"\")","v":""},null,{"$f":"IFERROR(VLOOKUP(ROWS(AL$2:$AL279),N279:Q1027,4,0),\"\")","v":""}]
[null,null,null,null,null,null,null,null,null,null,null,null,null,0,0,0,"ICICI Prudential Index Direct",15959,null,null,null,null,null,null,null,null,null,null,null,null,{"$f":"IFERROR(VLOOKUP(ROWS($AE$2:AE280),P280:Q1028,2,0),\"\")","v":""},null,null,null,null,{"$f":"IFERROR(VLOOKUP(ROWS(AJ$2:$AJ280),O280:Q1028,3,0),\"\")","v":""},null,{"$f":"IFERROR(VLOOKUP(ROWS(AL$2:$AL280),N280:Q1028,4,0),\"\")","v":""}]
[null,null,null,null,null,null,null,null,null,null,null,null,null,0,0,0,"ICICI Prudential Index Reg",1236,null,null,null,null,null,null,null,null,null,null,null,null,{"$f":"IFERROR(VLOOKUP(ROWS($AE$2:AE281),P281:Q1029,2,0),\"\")","v":""},null,null,null,null,{"$f":"IFERROR(VLOOKUP(ROWS(AJ$2:$AJ281),O281:Q1029,3,0),\"\")","v":""},null,{"$f":"IFERROR(VLOOKUP(ROWS(AL$2:$AL281),N281:Q1029,4,0),\"\")","v":""}]
[null,null,null,null,null,null,null,null,null,null,null,null,null,0,0,0,"ICICI Prudential Indo Asia Equity Direct",17116,null,null,null,null,null,null,null,null,null,null,null,null,{"$f":"IFERROR(VLOOKUP(ROWS($AE$2:AE282),P282:Q1030,2,0),\"\")","v":""},null,null,null,null,{"$f":"IFERROR(VLOOKUP(ROWS(AJ$2:$AJ282),O282:Q1030,3,0),\"\")","v":""},null,{"$f":"IFERROR(VLOOKUP(ROWS(AL$2:$AL282),N282:Q1030,4,0),\"\")","v":""}]
[null,null,null,null,null,null,null,null,null,null,null,null,null,0,0,0,"ICICI Prudential Indo Asia Equity Inst",5648,null,null,null,null,null,null,null,null,null,null,null,null,{"$f":"IFERROR(VLOOKUP(ROWS($AE$2:AE283),P283:Q1031,2,0),\"\")","v":""},null,null,null,null,{"$f":"IFERROR(VLOOKUP(ROWS(AJ$2:$AJ283),O283:Q1031,3,0),\"\")","v":""},null,{"$f":"IFERROR(VLOOKUP(ROWS(AL$2:$AL283),N283:Q1031,4,0),\"\")","v":""}]
[null,null,null,null,null,null,null,null,null,null,null,null,null,0,0,0,"ICICI Prudential Indo Asia Equity Reg",5646,null,null,null,null,null,null,null,null,null,null,null,null,{"$f":"IFERROR(VLOOKUP(ROWS($AE$2:AE284),P284:Q1032,2,0),\"\")","v":""},null,null,null,null,{"$f":"IFERROR(VLOOKUP(ROWS(AJ$2:$AJ284),O284:Q1032,3,0),\"\")","v":""},null,{"$f":"IFERROR(VLOOKUP(ROWS(AL$2:$AL284),N284:Q1032,4,0),\"\")","v":""}]
[null,null,null,null,null,null,null,null,null,null,null,null,null,0,0,0,"ICICI Prudential Infrastructure Direct",15849,null,null,null,null,null,null,null,null,null,null,null,null,{"$f":"IFERROR(VLOOKUP(ROWS($AE$2:AE285),P285:Q1033,2,0),\"\")","v":""},null,null,null,null,{"$f":"IFERROR(VLOOKUP(ROWS(AJ$2:$AJ285),O285:Q1033,3,0),\"\")","v":""},null,{"$f":"IFERROR(VLOOKUP(ROWS(AL$2:$AL285),N285:Q1033,4,0),\"\")","v":""}]
[null,null,null,null,null,null,null,null,null,null,null,null,null,0,0,0,"ICICI Prudential Infrastructure Inst I",4936,null,null,null,null,null,null,null,null,null,null,null,null,{"$f":"IFERROR(VLOOKUP(ROWS($AE$2:AE286),P286:Q1034,2,0),\"\")","v":""},null,null,null,null,{"$f":"IFERROR(VLOOKUP(ROWS(AJ$2:$AJ286),O286:Q1034,3,0),\"\")","v":""},null,{"$f":"IFERROR(VLOOKUP(ROWS(AL$2:$AL286),N286:Q1034,4,0),\"\")","v":""}]
[null,null,null,null,null,null,null,null,null,null,null,null,null,0,0,0,"ICICI Prudential Infrastructure Reg",2814,null,null,null,null,null,null,null,null,null,null,null,null,{"$f":"IFERROR(VLOOKUP(ROWS($AE$2:AE287),P287:Q1035,2,0),\"\")","v":""},null,null,null,null,{"$f":"IFERROR(VLOOKUP(ROWS(AJ$2:$AJ287),O287:Q1035,3,0),\"\")","v":""},null,{"$f":"IFERROR(VLOOKUP(ROWS(AL$2:$AL287),N287:Q1035,4,0),\"\")","v":""}]
[null,null,null,null,null,null,null,null,null,null,null,null,null,0,0,0,"ICICI Prudential Midcap Direct",15960,null,null,null,null,null,null,null,null,null,null,null,null,{"$f":"IFERROR(VLOOKUP(ROWS($AE$2:AE288),P288:Q1036,2,0),\"\")","v":""},null,null,null,null,{"$f":"IFERROR(VLOOKUP(ROWS(AJ$2:$AJ288),O288:Q1036,3,0),\"\")","v":""},null,{"$f":"IFERROR(VLOOKUP(ROWS(AL$2:$AL288),N288:Q1036,4,0),\"\")","v":""}]
[null,null,null,null,null,null,null,null,null,null,null,null,null,0,0,0,"ICICI Prudential Midcap Inst I",3402,null,null,null,null,null,null,null,null,null,null,null,null,{"$f":"IFERROR(VLOOKUP(ROWS($AE$2:AE289),P289:Q1037,2,0),\"\")","v":""},null,null,null,null,{"$f":"IFERROR(VLOOKUP(ROWS(AJ$2:$AJ289),O289:Q1037,3,0),\"\")","v":""},null,{"$f":"IFERROR(VLOOKUP(ROWS(AL$2:$AL289),N289:Q1037,4,0),\"\")","v":""}]
[null,null,null,null,null,null,null,null,null,null,null,null,null,0,0,0,"ICICI Prudential Midcap Reg",2439,null,null,null,null,null,null,null,null,null,null,null,null,{"$f":"IFERROR(VLOOKUP(ROWS($AE$2:AE290),P290:Q1038,2,0),\"\")","v":""},null,null,null,null,{"$f":"IFERROR(VLOOKUP(ROWS(AJ$2:$AJ290),O290:Q1038,3,0),\"\")","v":""},null,{"$f":"IFERROR(VLOOKUP(ROWS(AL$2:$AL290),N290:Q1038,4,0),\"\")","v":""}]
[null,null,null,null,null,null,null,null,null,null,null,null,null,0,0,0,"ICICI Prudential Nifty ETF",18653,null,null,null,null,null,null,null,null,null,null,null,null,{"$f":"IFERROR(VLOOKUP(ROWS($AE$2:AE291),P291:Q1039,2,0),\"\")","v":""},null,null,null,null,{"$f":"IFERROR(VLOOKUP(ROWS(AJ$2:$AJ291),O291:Q1039,3,0),\"\")","v":""},null,{"$f":"IFERROR(VLOOKUP(ROWS(AL$2:$AL291),N291:Q1039,4,0),\"\")","v":""}]
[null,null,null,null,null,null,null,null,null,null,null,null,null,0,0,0,"ICICI Prudential Nifty Junior Index",11236,null,null,null,null,null,null,null,null,null,null,null,null,{"$f":"IFERROR(VLOOKUP(ROWS($AE$2:AE292),P292:Q1040,2,0),\"\")","v":""},null,null,null,null,{"$f":"IFERROR(VLOOKUP(ROWS(AJ$2:$AJ292),O292:Q1040,3,0),\"\")","v":""},null,{"$f":"IFERROR(VLOOKUP(ROWS(AL$2:$AL292),N292:Q1040,4,0),\"\")","v":""}]
[null,null,null,null,null,null,null,null,null,null,null,null,null,0,0,0,"ICICI Prudential Nifty Junior Index Direct",15856,null,null,null,null,null,null,null,null,null,null,null,null,{"$f":"IFERROR(VLOOKUP(ROWS($AE$2:AE293),P293:Q1041,2,0),\"\")","v":""},null,null,null,null,{"$f":"IFERROR(VLOOKUP(ROWS(AJ$2:$AJ293),O293:Q1041,3,0),\"\")","v":""},null,{"$f":"IFERROR(VLOOKUP(ROWS(AL$2:$AL293),N293:Q1041,4,0),\"\")","v":""}]
[null,null,null,null,null,null,null,null,null,null,null,null,null,0,0,0,"ICICI Prudential SPIcE",1512,null,null,null,null,null,null,null,null,null,null,null,null,{"$f":"IFERROR(VLOOKUP(ROWS($AE$2:AE294),P294:Q1042,2,0),\"\")","v":""},null,null,null,null,{"$f":"IFERROR(VLOOKUP(ROWS(AJ$2:$AJ294),O294:Q1042,3,0),\"\")","v":""},null,{"$f":"IFERROR(VLOOKUP(ROWS(AL$2:$AL294),N294:Q1042,4,0),\"\")","v":""}]
[null,null,null,null,null,null,null,null,null,null,null,null,null,0,0,0,"ICICI Prudential Target Returns Direct",17412,null,null,null,null,null,null,null,null,null,null,null,null,{"$f":"IFERROR(VLOOKUP(ROWS($AE$2:AE295),P295:Q1043,2,0),\"\")","v":""},null,null,null,null,{"$f":"IFERROR(VLOOKUP(ROWS(AJ$2:$AJ295),O295:Q1043,3,0),\"\")","v":""},null,{"$f":"IFERROR(VLOOKUP(ROWS(AL$2:$AL295),N295:Q1043,4,0),\"\")","v":""}]
[null,null,null,null,null,null,null,null,null,null,null,null,null,0,0,0,"ICICI Prudential Target Returns Reg",10399,null,null,null,null,null,null,null,null,null,null,null,null,{"$f":"IFERROR(VLOOKUP(ROWS($AE$2:AE296),P296:Q1044,2,0),\"\")","v":""},null,null,null,null,{"$f":"IFERROR(VLOOKUP(ROWS(AJ$2:$AJ296),O296:Q1044,3,0),\"\")","v":""},null,{"$f":"IFERROR(VLOOKUP(ROWS(AL$2:$AL296),N296:Q1044,4,0),\"\")","v":""}]
[null,null,null,null,null,null,null,null,null,null,null,null,null,0,0,0,"ICICI Prudential Tax Direct",15862,null,null,null,null,null,null,null,null,null,null,null,null,{"$f":"IFERROR(VLOOKUP(ROWS($AE$2:AE297),P297:Q1045,2,0),\"\")","v":""},null,null,null,null,{"$f":"IFERROR(VLOOKUP(ROWS(AJ$2:$AJ297),O297:Q1045,3,0),\"\")","v":""},null,{"$f":"IFERROR(VLOOKUP(ROWS(AL$2:$AL297),N297:Q1045,4,0),\"\")","v":""}]
[null,null,null,null,null,null,null,null,null,null,null,null,null,0,0,0,"ICICI Prudential Tax Plan Reg",640,null,null,null,null,null,null,null,null,null,null,null,null,{"$f":"IFERROR(VLOOKUP(ROWS($AE$2:AE298),P298:Q1046,2,0),\"\")","v":""},null,null,null,null,{"$f":"IFERROR(VLOOKUP(ROWS(AJ$2:$AJ298),O298:Q1046,3,0),\"\")","v":""},null,{"$f":"IFERROR(VLOOKUP(ROWS(AL$2:$AL298),N298:Q1046,4,0),\"\")","v":""}]
[null,null,null,null,null,null,null,null,null,null,null,null,null,0,0,0,"ICICI Prudential Technology Direct",15864,null,null,null,null,null,null,null,null,null,null,null,null,{"$f":"IFERROR(VLOOKUP(ROWS($AE$2:AE299),P299:Q1047,2,0),\"\")","v":""},null,null,null,null,{"$f":"IFERROR(VLOOKUP(ROWS(AJ$2:$AJ299),O299:Q1047,3,0),\"\")","v":""},null,{"$f":"IFERROR(VLOOKUP(ROWS(AL$2:$AL299),N299:Q1047,4,0),\"\")","v":""}]
[null,null,null,null,null,null,null,null,null,null,null,null,null,0,0,0,"ICICI Prudential Technology Reg",737,null,null,null,null,null,null,null,null,null,null,null,null,{"$f":"IFERROR(VLOOKUP(ROWS($AE$2:AE300),P300:Q1048,2,0),\"\")","v":""},null,null,null,null,{"$f":"IFERROR(VLOOKUP(ROWS(AJ$2:$AJ300),O300:Q1048,3,0),\"\")","v":""},null,{"$f":"IFERROR(VLOOKUP(ROWS(AL$2:$AL300),N300:Q1048,4,0),\"\")","v":""}]
[null,null,null,null,null,null,null,null,null,null,null,null,null,0,0,0,"ICICI Prudential Top 100 Direct",15868,null,null,null,null,null,null,null,null,null,null,null,null,{"$f":"IFERROR(VLOOKUP(ROWS($AE$2:AE301),P301:Q1049,2,0),\"\")","v":""},null,null,null,null,{"$f":"IFERROR(VLOOKUP(ROWS(AJ$2:$AJ301),O301:Q1049,3,0),\"\")","v":""},null,{"$f":"IFERROR(VLOOKUP(ROWS(AL$2:$AL301),N301:Q1049,4,0),\"\")","v":""}]
[null,null,null,null,null,null,null,null,null,null,null,null,null,0,0,0,"ICICI Prudential Top 100 Inst I",3279,null,null,null,null,null,null,null,null,null,null,null,null,{"$f":"IFERROR(VLOOKUP(ROWS($AE$2:AE302),P302:Q1050,2,0),\"\")","v":""},null,null,null,null,{"$f":"IFERROR(VLOOKUP(ROWS(AJ$2:$AJ302),O302:Q1050,3,0),\"\")","v":""},null,{"$f":"IFERROR(VLOOKUP(ROWS(AL$2:$AL302),N302:Q1050,4,0),\"\")","v":""}]
[null,null,null,null,null,null,null,null,null,null,null,null,null,0,0,0,"ICICI Prudential Top 100 Reg",534,null,null,null,null,null,null,null,null,null,null,null,null,{"$f":"IFERROR(VLOOKUP(ROWS($AE$2:AE303),P303:Q1051,2,0),\"\")","v":""},null,null,null,null,{"$f":"IFERROR(VLOOKUP(ROWS(AJ$2:$AJ303),O303:Q1051,3,0),\"\")","v":""},null,{"$f":"IFERROR(VLOOKUP(ROWS(AL$2:$AL303),N303:Q1051,4,0),\"\")","v":""}]
[null,null,null,null,null,null,null,null,null,null,null,null,null,0,0,0,"ICICI Prudential Top 200 Direct",15874,null,null,null,null,null,null,null,null,null,null,null,null,{"$f":"IFERROR(VLOOKUP(ROWS($AE$2:AE304),P304:Q1052,2,0),\"\")","v":""},null,null,null,null,{"$f":"IFERROR(VLOOKUP(ROWS(AJ$2:$AJ304),O304:Q1052,3,0),\"\")","v":""},null,{"$f":"IFERROR(VLOOKUP(ROWS(AL$2:$AL304),N304:Q1052,4,0),\"\")","v":""}]
[null,null,null,null,null,null,null,null,null,null,null,null,null,0,0,0,"ICICI Prudential Top 200 Inst I",2857,null,null,null,null,null,null,null,null,null,null,null,null,{"$f":"IFERROR(VLOOKUP(ROWS($AE$2:AE305),P305:Q1053,2,0),\"\")","v":""},null,null,null,null,{"$f":"IFERROR(VLOOKUP(ROWS(AJ$2:$AJ305),O305:Q1053,3,0),\"\")","v":""},null,{"$f":"IFERROR(VLOOKUP(ROWS(AL$2:$AL305),N305:Q1053,4,0),\"\")","v":""}]
[null,null,null,null,null,null,null,null,null,null,null,null,null,0,0,0,"ICICI Prudential Top 200 Reg",86,null,null,null,null,null,null,null,null,null,null,null,null,{"$f":"IFERROR(VLOOKUP(ROWS($AE$2:AE306),P306:Q1054,2,0),\"\")","v":""},null,null,null,null,{"$f":"IFERROR(VLOOKUP(ROWS(AJ$2:$AJ306),O306:Q1054,3,0),\"\")","v":""},null,{"$f":"IFERROR(VLOOKUP(ROWS(AL$2:$AL306),N306:Q1054,4,0),\"\")","v":""}]
[null,null,null,null,null,null,null,null,null,null,null,null,null,0,0,0,"ICICI Prudential US Bluechip Equity",14998,null,null,null,null,null,null,null,null,null,null,null,null,{"$f":"IFERROR(VLOOKUP(ROWS($AE$2:AE307),P307:Q1055,2,0),\"\")","v":""},null,null,null,null,{"$f":"IFERROR(VLOOKUP(ROWS(AJ$2:$AJ307),O307:Q1055,3,0),\"\")","v":""},null,{"$f":"IFERROR(VLOOKUP(ROWS(AL$2:$AL307),N307:Q1055,4,0),\"\")","v":""}]
[null,null,null,null,null,null,null,null,null,null,null,null,null,0,0,0,"ICICI Prudential US Bluechip Equity Direct",17160,null,null,null,null,null,null,null,null,null,null,null,null,{"$f":"IFERROR(VLOOKUP(ROWS($AE$2:AE308),P308:Q1056,2,0),\"\")","v":""},null,null,null,null,{"$f":"IFERROR(VLOOKUP(ROWS(AJ$2:$AJ308),O308:Q1056,3,0),\"\")","v":""},null,{"$f":"IFERROR(VLOOKUP(ROWS(AL$2:$AL308),N308:Q1056,4,0),\"\")","v":""}]
[null,null,null,null,null,null,null,null,null,null,null,null,null,0,0,0,"IDBI India Top 100 Equity",14722,null,null,null,null,null,null,null,null,null,null,null,null,{"$f":"IFERROR(VLOOKUP(ROWS($AE$2:AE309),P309:Q1057,2,0),\"\")","v":""},null,null,null,null,{"$f":"IFERROR(VLOOKUP(ROWS(AJ$2:$AJ309),O309:Q1057,3,0),\"\")","v":""},null,{"$f":"IFERROR(VLOOKUP(ROWS(AL$2:$AL309),N309:Q1057,4,0),\"\")","v":""}]
[null,null,null,null,null,null,null,null,null,null,null,null,null,0,0,0,"IDBI India Top 100 Equity Direct",16499,null,null,null,null,null,null,null,null,null,null,null,null,{"$f":"IFERROR(VLOOKUP(ROWS($AE$2:AE310),P310:Q1058,2,0),\"\")","v":""},null,null,null,null,{"$f":"IFERROR(VLOOKUP(ROWS(AJ$2:$AJ310),O310:Q1058,3,0),\"\")","v":""},null,{"$f":"IFERROR(VLOOKUP(ROWS(AL$2:$AL310),N310:Q1058,4,0),\"\")","v":""}]
[null,null,null,null,null,null,null,null,null,null,null,null,null,0,0,0,"IDBI Nifty Index",11188,null,null,null,null,null,null,null,null,null,null,null,null,{"$f":"IFERROR(VLOOKUP(ROWS($AE$2:AE311),P311:Q1059,2,0),\"\")","v":""},null,null,null,null,{"$f":"IFERROR(VLOOKUP(ROWS(AJ$2:$AJ311),O311:Q1059,3,0),\"\")","v":""},null,{"$f":"IFERROR(VLOOKUP(ROWS(AL$2:$AL311),N311:Q1059,4,0),\"\")","v":""}]
[null,null,null,null,null,null,null,null,null,null,null,null,null,0,0,0,"IDBI Nifty Index Direct",16523,null,null,null,null,null,null,null,null,null,null,null,null,{"$f":"IFERROR(VLOOKUP(ROWS($AE$2:AE312),P312:Q1060,2,0),\"\")","v":""},null,null,null,null,{"$f":"IFERROR(VLOOKUP(ROWS(AJ$2:$AJ312),O312:Q1060,3,0),\"\")","v":""},null,{"$f":"IFERROR(VLOOKUP(ROWS(AL$2:$AL312),N312:Q1060,4,0),\"\")","v":""}]
[null,null,null,null,null,null,null,null,null,null,null,null,null,0,0,0,"IDBI Nifty Junior Index",11500,null,null,null,null,null,null,null,null,null,null,null,null,{"$f":"IFERROR(VLOOKUP(ROWS($AE$2:AE313),P313:Q1061,2,0),\"\")","v":""},null,null,null,null,{"$f":"IFERROR(VLOOKUP(ROWS(AJ$2:$AJ313),O313:Q1061,3,0),\"\")","v":""},null,{"$f":"IFERROR(VLOOKUP(ROWS(AL$2:$AL313),N313:Q1061,4,0),\"\")","v":""}]
[null,null,null,null,null,null,null,null,null,null,null,null,null,0,0,0,"IDBI Nifty Junior Index Direct",16528,null,null,null,null,null,null,null,null,null,null,null,null,{"$f":"IFERROR(VLOOKUP(ROWS($AE$2:AE314),P314:Q1062,2,0),\"\")","v":""},null,null,null,null,{"$f":"IFERROR(VLOOKUP(ROWS(AJ$2:$AJ314),O314:Q1062,3,0),\"\")","v":""},null,{"$f":"IFERROR(VLOOKUP(ROWS(AL$2:$AL314),N314:Q1062,4,0),\"\")","v":""}]
[null,null,null,null,null,null,null,null,null,null,null,null,null,0,0,0,"IDBI Tax Saving Direct",20683,null,null,null,null,null,null,null,null,null,null,null,null,{"$f":"IFERROR(VLOOKUP(ROWS($AE$2:AE315),P315:Q1063,2,0),\"\")","v":""},null,null,null,null,{"$f":"IFERROR(VLOOKUP(ROWS(AJ$2:$AJ315),O315:Q1063,3,0),\"\")","v":""},null,{"$f":"IFERROR(VLOOKUP(ROWS(AL$2:$AL315),N315:Q1063,4,0),\"\")","v":""}]
[null,null,null,null,null,null,null,null,null,null,null,null,null,0,0,0,"IDBI Tax Saving Reg",20681,null,null,null,null,null,null,null,null,null,null,null,null,{"$f":"IFERROR(VLOOKUP(ROWS($AE$2:AE316),P316:Q1064,2,0),\"\")","v":""},null,null,null,null,{"$f":"IFERROR(VLOOKUP(ROWS(AJ$2:$AJ316),O316:Q1064,3,0),\"\")","v":""},null,{"$f":"IFERROR(VLOOKUP(ROWS(AL$2:$AL316),N316:Q1064,4,0),\"\")","v":""}]
[null,null,null,null,null,null,null,null,null,null,null,null,null,0,0,0,"IDFC Classic Equity Direct",16474,null,null,null,null,null,null,null,null,null,null,null,null,{"$f":"IFERROR(VLOOKUP(ROWS($AE$2:AE317),P317:Q1065,2,0),\"\")","v":""},null,null,null,null,{"$f":"IFERROR(VLOOKUP(ROWS(AJ$2:$AJ317),O317:Q1065,3,0),\"\")","v":""},null,{"$f":"IFERROR(VLOOKUP(ROWS(AL$2:$AL317),N317:Q1065,4,0),\"\")","v":""}]
[null,null,null,null,null,null,null,null,null,null,null,null,null,0,0,0,"IDFC Classic Equity Plan B#",10376,null,null,null,null,null,null,null,null,null,null,null,null,{"$f":"IFERROR(VLOOKUP(ROWS($AE$2:AE318),P318:Q1066,2,0),\"\")","v":""},null,null,null,null,{"$f":"IFERROR(VLOOKUP(ROWS(AJ$2:$AJ318),O318:Q1066,3,0),\"\")","v":""},null,{"$f":"IFERROR(VLOOKUP(ROWS(AL$2:$AL318),N318:Q1066,4,0),\"\")","v":""}]
[null,null,null,null,null,null,null,null,null,null,null,null,null,0,0,0,"IDFC Classic Equity Regular",2797,null,null,null,null,null,null,null,null,null,null,null,null,{"$f":"IFERROR(VLOOKUP(ROWS($AE$2:AE319),P319:Q1067,2,0),\"\")","v":""},null,null,null,null,{"$f":"IFERROR(VLOOKUP(ROWS(AJ$2:$AJ319),O319:Q1067,3,0),\"\")","v":""},null,{"$f":"IFERROR(VLOOKUP(ROWS(AL$2:$AL319),N319:Q1067,4,0),\"\")","v":""}]
[null,null,null,null,null,null,null,null,null,null,null,null,null,0,0,0,"IDFC Equity Direct",16699,null,null,null,null,null,null,null,null,null,null,null,null,{"$f":"IFERROR(VLOOKUP(ROWS($AE$2:AE320),P320:Q1068,2,0),\"\")","v":""},null,null,null,null,{"$f":"IFERROR(VLOOKUP(ROWS(AJ$2:$AJ320),O320:Q1068,3,0),\"\")","v":""},null,{"$f":"IFERROR(VLOOKUP(ROWS(AL$2:$AL320),N320:Q1068,4,0),\"\")","v":""}]
[null,null,null,null,null,null,null,null,null,null,null,null,null,0,0,0,"IDFC Equity Regular",3400,null,null,null,null,null,null,null,null,null,null,null,null,{"$f":"IFERROR(VLOOKUP(ROWS($AE$2:AE321),P321:Q1069,2,0),\"\")","v":""},null,null,null,null,{"$f":"IFERROR(VLOOKUP(ROWS(AJ$2:$AJ321),O321:Q1069,3,0),\"\")","v":""},null,{"$f":"IFERROR(VLOOKUP(ROWS(AL$2:$AL321),N321:Q1069,4,0),\"\")","v":""}]
[null,null,null,null,null,null,null,null,null,null,null,null,null,0,0,{"$f":"IF(ISNUMBER(SEARCH($H$6,Q322)),MAX($P$1,P321)+1,0)","v":0},"IDFC Imperial Equity Direct",16507,null,null,null,null,null,null,null,null,null,null,null,null,{"$f":"IFERROR(VLOOKUP(ROWS($AE$2:AE322),P322:Q1070,2,0),\"\")","v":""},null,null,null,null,{"$f":"IFERROR(VLOOKUP(ROWS(AJ$2:$AJ322),O322:Q1070,3,0),\"\")","v":""},null,{"$f":"IFERROR(VLOOKUP(ROWS(AL$2:$AL322),N322:Q1070,4,0),\"\")","v":""}]
[null,null,null,null,null,null,null,null,null,null,null,null,null,{"$f":"IF(ISNUMBER(SEARCH($H$16,Q323)),MAX($N$1,N322)+1,0)","v":0},{"$f":"IF(ISNUMBER(SEARCH($H$11,Q323)),MAX($O$1,O322)+1,0)","v":0},0,"IDFC Imperial Equity Regular",3151,null,null,null,null,null,null,null,null,null,null,null,null,{"$f":"IFERROR(VLOOKUP(ROWS($AE$2:AE323),P323:Q1071,2,0),\"\")","v":""},null,null,null,null,{"$f":"IFERROR(VLOOKUP(ROWS(AJ$2:$AJ323),O323:Q1071,3,0),\"\")","v":""},null,{"$f":"IFERROR(VLOOKUP(ROWS(AL$2:$AL323),N323:Q1071,4,0),\"\")","v":""}]
[null,null,null,null,null,null,null,null,null,null,null,null,null,0,0,0,"IDFC India GDP Growth Direct",16512,null,null,null,null,null,null,null,null,null,null,null,null,{"$f":"IFERROR(VLOOKUP(ROWS($AE$2:AE324),P324:Q1072,2,0),\"\")","v":""},null,null,null,null,{"$f":"IFERROR(VLOOKUP(ROWS(AJ$2:$AJ324),O324:Q1072,3,0),\"\")","v":""},null,{"$f":"IFERROR(VLOOKUP(ROWS(AL$2:$AL324),N324:Q1072,4,0),\"\")","v":""}]
[null,null,null,null,null,null,null,null,null,null,null,null,null,0,0,0,"IDFC India GDP Growth Regular",10216,null,null,null,null,null,null,null,null,null,null,null,null,{"$f":"IFERROR(VLOOKUP(ROWS($AE$2:AE325),P325:Q1073,2,0),\"\")","v":""},null,null,null,null,{"$f":"IFERROR(VLOOKUP(ROWS(AJ$2:$AJ325),O325:Q1073,3,0),\"\")","v":""},null,{"$f":"IFERROR(VLOOKUP(ROWS(AL$2:$AL325),N325:Q1073,4,0),\"\")","v":""}]
[null,null,null,null,null,null,null,null,null,null,null,null,null,0,0,0,"IDFC Infrastructure Direct",16514,null,null,null,null,null,null,null,null,null,null,null,null,{"$f":"IFERROR(VLOOKUP(ROWS($AE$2:AE326),P326:Q1074,2,0),\"\")","v":""},null,null,null,null,{"$f":"IFERROR(VLOOKUP(ROWS(AJ$2:$AJ326),O326:Q1074,3,0),\"\")","v":""},null,{"$f":"IFERROR(VLOOKUP(ROWS(AL$2:$AL326),N326:Q1074,4,0),\"\")","v":""}]
[null,null,null,null,null,null,null,null,null,null,null,null,null,0,0,0,"IDFC Infrastructure Regular",12129,null,null,null,null,null,null,null,null,null,null,null,null,{"$f":"IFERROR(VLOOKUP(ROWS($AE$2:AE327),P327:Q1075,2,0),\"\")","v":""},null,null,null,null,{"$f":"IFERROR(VLOOKUP(ROWS(AJ$2:$AJ327),O327:Q1075,3,0),\"\")","v":""},null,{"$f":"IFERROR(VLOOKUP(ROWS(AL$2:$AL327),N327:Q1075,4,0),\"\")","v":""}]
[null,null,null,null,null,null,null,null,null,null,null,null,null,0,0,0,"IDFC Nifty Direct",16504,null,null,null,null,null,null,null,null,null,null,null,null,{"$f":"IFERROR(VLOOKUP(ROWS($AE$2:AE328),P328:Q1076,2,0),\"\")","v":""},null,null,null,null,{"$f":"IFERROR(VLOOKUP(ROWS(AJ$2:$AJ328),O328:Q1076,3,0),\"\")","v":""},null,{"$f":"IFERROR(VLOOKUP(ROWS(AL$2:$AL328),N328:Q1076,4,0),\"\")","v":""}]
[null,null,null,null,null,null,null,null,null,null,null,null,null,0,0,0,"IDFC Nifty Regular",11154,null,null,null,null,null,null,null,null,null,null,null,null,{"$f":"IFERROR(VLOOKUP(ROWS($AE$2:AE329),P329:Q1077,2,0),\"\")","v":""},null,null,null,null,{"$f":"IFERROR(VLOOKUP(ROWS(AJ$2:$AJ329),O329:Q1077,3,0),\"\")","v":""},null,{"$f":"IFERROR(VLOOKUP(ROWS(AL$2:$AL329),N329:Q1077,4,0),\"\")","v":""}]
[null,null,null,null,null,null,null,null,null,null,null,null,null,0,0,1,"IDFC Premier Equity Direct",16501,null,null,null,null,null,null,null,null,null,null,null,null,{"$f":"IFERROR(VLOOKUP(ROWS($AE$2:AE330),P330:Q1078,2,0),\"\")","v":""},null,null,null,null,{"$f":"IFERROR(VLOOKUP(ROWS(AJ$2:$AJ330),O330:Q1078,3,0),\"\")","v":""},null,{"$f":"IFERROR(VLOOKUP(ROWS(AL$2:$AL330),N330:Q1078,4,0),\"\")","v":""}]
[null,null,null,null,null,null,null,null,null,null,null,null,null,0,0,2,"IDFC Premier Equity Regular",2886,null,null,null,null,null,null,null,null,null,null,null,null,{"$f":"IFERROR(VLOOKUP(ROWS($AE$2:AE331),P331:Q1079,2,0),\"\")","v":""},null,null,null,null,{"$f":"IFERROR(VLOOKUP(ROWS(AJ$2:$AJ331),O331:Q1079,3,0),\"\")","v":""},null,{"$f":"IFERROR(VLOOKUP(ROWS(AL$2:$AL331),N331:Q1079,4,0),\"\")","v":""}]
[null,null,null,null,null,null,null,null,null,null,null,null,null,0,0,0,"IDFC Sterling Equity Direct",16498,null,null,null,null,null,null,null,null,null,null,null,null,{"$f":"IFERROR(VLOOKUP(ROWS($AE$2:AE332),P332:Q1080,2,0),\"\")","v":""},null,null,null,null,{"$f":"IFERROR(VLOOKUP(ROWS(AJ$2:$AJ332),O332:Q1080,3,0),\"\")","v":""},null,{"$f":"IFERROR(VLOOKUP(ROWS(AL$2:$AL332),N332:Q1080,4,0),\"\")","v":""}]
[null,null,null,null,null,null,null,null,null,null,null,null,null,0,0,0,"IDFC Sterling Equity Regular",6693,null,null,null,null,null,null,null,null,null,null,null,null,{"$f":"IFERROR(VLOOKUP(ROWS($AE$2:AE333),P333:Q1081,2,0),\"\")","v":""},null,null,null,null,{"$f":"IFERROR(VLOOKUP(ROWS(AJ$2:$AJ333),O333:Q1081,3,0),\"\")","v":""},null,{"$f":"IFERROR(VLOOKUP(ROWS(AL$2:$AL333),N333:Q1081,4,0),\"\")","v":""}]
[null,null,null,null,null,null,null,null,null,null,null,null,null,0,0,0,"IDFC Strategic Sector (50-50) Equity Direct",16710,null,null,null,null,null,null,null,null,null,null,null,null,{"$f":"IFERROR(VLOOKUP(ROWS($AE$2:AE334),P334:Q1082,2,0),\"\")","v":""},null,null,null,null,{"$f":"IFERROR(VLOOKUP(ROWS(AJ$2:$AJ334),O334:Q1082,3,0),\"\")","v":""},null,{"$f":"IFERROR(VLOOKUP(ROWS(AL$2:$AL334),N334:Q1082,4,0),\"\")","v":""}]
[null,null,null,null,null,null,null,null,null,null,null,null,null,0,0,0,"IDFC Strategic Sector (50-50) Equity Regular",8871,null,null,null,null,null,null,null,null,null,null,null,null,{"$f":"IFERROR(VLOOKUP(ROWS($AE$2:AE335),P335:Q1083,2,0),\"\")","v":""},null,null,null,null,{"$f":"IFERROR(VLOOKUP(ROWS(AJ$2:$AJ335),O335:Q1083,3,0),\"\")","v":""},null,{"$f":"IFERROR(VLOOKUP(ROWS(AL$2:$AL335),N335:Q1083,4,0),\"\")","v":""}]
[null,null,null,null,null,null,null,null,null,null,null,null,null,0,0,0,"IDFC Tax Advantage (ELSS) Direct",16493,null,null,null,null,null,null,null,null,null,null,null,null,{"$f":"IFERROR(VLOOKUP(ROWS($AE$2:AE336),P336:Q1084,2,0),\"\")","v":""},null,null,null,null,{"$f":"IFERROR(VLOOKUP(ROWS(AJ$2:$AJ336),O336:Q1084,3,0),\"\")","v":""},null,{"$f":"IFERROR(VLOOKUP(ROWS(AL$2:$AL336),N336:Q1084,4,0),\"\")","v":""}]
[null,null,null,null,null,null,null,null,null,null,null,null,null,0,0,0,"IDFC Tax Advantage (ELSS) Regular",10032,null,null,null,null,null,null,null,null,null,null,null,null,{"$f":"IFERROR(VLOOKUP(ROWS($AE$2:AE337),P337:Q1085,2,0),\"\")","v":""},null,null,null,null,{"$f":"IFERROR(VLOOKUP(ROWS(AJ$2:$AJ337),O337:Q1085,3,0),\"\")","v":""},null,{"$f":"IFERROR(VLOOKUP(ROWS(AL$2:$AL337),N337:Q1085,4,0),\"\")","v":""}]
[null,null,null,null,null,null,null,null,null,null,null,null,null,0,0,0,"IIFL Dividend Opportunities Index",14972,null,null,null,null,null,null,null,null,null,null,null,null,{"$f":"IFERROR(VLOOKUP(ROWS($AE$2:AE338),P338:Q1086,2,0),\"\")","v":""},null,null,null,null,{"$f":"IFERROR(VLOOKUP(ROWS(AJ$2:$AJ338),O338:Q1086,3,0),\"\")","v":""},null,{"$f":"IFERROR(VLOOKUP(ROWS(AL$2:$AL338),N338:Q1086,4,0),\"\")","v":""}]
[null,null,null,null,null,null,null,null,null,null,null,null,null,0,0,0,"IIFL Dividend Opportunities Index Direct",16475,null,null,null,null,null,null,null,null,null,null,null,null,{"$f":"IFERROR(VLOOKUP(ROWS($AE$2:AE339),P339:Q1087,2,0),\"\")","v":""},null,null,null,null,{"$f":"IFERROR(VLOOKUP(ROWS(AJ$2:$AJ339),O339:Q1087,3,0),\"\")","v":""},null,{"$f":"IFERROR(VLOOKUP(ROWS(AL$2:$AL339),N339:Q1087,4,0),\"\")","v":""}]
[null,null,null,null,null,null,null,null,null,null,null,null,null,0,0,0,"IIFL Nifty ETF",13382,null,null,null,null,null,null,null,null,null,null,null,null,{"$f":"IFERROR(VLOOKUP(ROWS($AE$2:AE340),P340:Q1088,2,0),\"\")","v":""},null,null,null,null,{"$f":"IFERROR(VLOOKUP(ROWS(AJ$2:$AJ340),O340:Q1088,3,0),\"\")","v":""},null,{"$f":"IFERROR(VLOOKUP(ROWS(AL$2:$AL340),N340:Q1088,4,0),\"\")","v":""}]
[null,null,null,null,null,null,null,null,null,null,null,null,null,0,0,0,"Indiabulls Bluechip",14013,null,null,null,null,null,null,null,null,null,null,null,null,{"$f":"IFERROR(VLOOKUP(ROWS($AE$2:AE341),P341:Q1089,2,0),\"\")","v":""},null,null,null,null,{"$f":"IFERROR(VLOOKUP(ROWS(AJ$2:$AJ341),O341:Q1089,3,0),\"\")","v":""},null,{"$f":"IFERROR(VLOOKUP(ROWS(AL$2:$AL341),N341:Q1089,4,0),\"\")","v":""}]
[null,null,null,null,null,null,null,null,null,null,null,null,null,0,0,0,"Indiabulls Bluechip Direct",15579,null,null,null,null,null,null,null,null,null,null,null,null,{"$f":"IFERROR(VLOOKUP(ROWS($AE$2:AE342),P342:Q1090,2,0),\"\")","v":""},null,null,null,null,{"$f":"IFERROR(VLOOKUP(ROWS(AJ$2:$AJ342),O342:Q1090,3,0),\"\")","v":""},null,{"$f":"IFERROR(VLOOKUP(ROWS(AL$2:$AL342),N342:Q1090,4,0),\"\")","v":""}]
[null,null,null,null,null,null,null,null,null,null,null,null,null,0,0,0,"ING Core Equity",606,null,null,null,null,null,null,null,null,null,null,null,null,{"$f":"IFERROR(VLOOKUP(ROWS($AE$2:AE343),P343:Q1091,2,0),\"\")","v":""},null,null,null,null,{"$f":"IFERROR(VLOOKUP(ROWS(AJ$2:$AJ343),O343:Q1091,3,0),\"\")","v":""},null,{"$f":"IFERROR(VLOOKUP(ROWS(AL$2:$AL343),N343:Q1091,4,0),\"\")","v":""}]
[null,null,null,null,null,null,null,null,null,null,null,null,null,0,0,0,"ING Core Equity Direct",16901,null,null,null,null,null,null,null,null,null,null,null,null,{"$f":"IFERROR(VLOOKUP(ROWS($AE$2:AE344),P344:Q1092,2,0),\"\")","v":""},null,null,null,null,{"$f":"IFERROR(VLOOKUP(ROWS(AJ$2:$AJ344),O344:Q1092,3,0),\"\")","v":""},null,{"$f":"IFERROR(VLOOKUP(ROWS(AL$2:$AL344),N344:Q1092,4,0),\"\")","v":""}]
[null,null,null,null,null,null,null,null,null,null,null,null,null,0,0,0,"ING Dividend Yield",2879,null,null,null,null,null,null,null,null,null,null,null,null,{"$f":"IFERROR(VLOOKUP(ROWS($AE$2:AE345),P345:Q1093,2,0),\"\")","v":""},null,null,null,null,{"$f":"IFERROR(VLOOKUP(ROWS(AJ$2:$AJ345),O345:Q1093,3,0),\"\")","v":""},null,{"$f":"IFERROR(VLOOKUP(ROWS(AL$2:$AL345),N345:Q1093,4,0),\"\")","v":""}]
[null,null,null,null,null,null,null,null,null,null,null,null,null,0,0,0,"ING Dividend Yield Direct",16907,null,null,null,null,null,null,null,null,null,null,null,null,{"$f":"IFERROR(VLOOKUP(ROWS($AE$2:AE346),P346:Q1094,2,0),\"\")","v":""},null,null,null,null,{"$f":"IFERROR(VLOOKUP(ROWS(AJ$2:$AJ346),O346:Q1094,3,0),\"\")","v":""},null,{"$f":"IFERROR(VLOOKUP(ROWS(AL$2:$AL346),N346:Q1094,4,0),\"\")","v":""}]
[null,null,null,null,null,null,null,null,null,null,null,null,null,0,0,0,"ING Global Real Estate Retail",6275,null,null,null,null,null,null,null,null,null,null,null,null,{"$f":"IFERROR(VLOOKUP(ROWS($AE$2:AE347),P347:Q1095,2,0),\"\")","v":""},null,null,null,null,{"$f":"IFERROR(VLOOKUP(ROWS(AJ$2:$AJ347),O347:Q1095,3,0),\"\")","v":""},null,{"$f":"IFERROR(VLOOKUP(ROWS(AL$2:$AL347),N347:Q1095,4,0),\"\")","v":""}]
[null,null,null,null,null,null,null,null,null,null,null,null,null,0,0,0,"ING Global Real Estate Retail Direct",17099,null,null,null,null,null,null,null,null,null,null,null,null,{"$f":"IFERROR(VLOOKUP(ROWS($AE$2:AE348),P348:Q1096,2,0),\"\")","v":""},null,null,null,null,{"$f":"IFERROR(VLOOKUP(ROWS(AJ$2:$AJ348),O348:Q1096,3,0),\"\")","v":""},null,{"$f":"IFERROR(VLOOKUP(ROWS(AL$2:$AL348),N348:Q1096,4,0),\"\")","v":""}]
[null,null,null,null,null,null,null,null,null,null,null,null,null,0,0,0,"ING Large Cap Equity",2063,null,null,null,null,null,null,null,null,null,null,null,null,{"$f":"IFERROR(VLOOKUP(ROWS($AE$2:AE349),P349:Q1097,2,0),\"\")","v":""},null,null,null,null,{"$f":"IFERROR(VLOOKUP(ROWS(AJ$2:$AJ349),O349:Q1097,3,0),\"\")","v":""},null,{"$f":"IFERROR(VLOOKUP(ROWS(AL$2:$AL349),N349:Q1097,4,0),\"\")","v":""}]
[null,null,null,null,null,null,null,null,null,null,null,null,null,0,0,0,"ING Large Cap Equity Direct",16937,null,null,null,null,null,null,null,null,null,null,null,null,{"$f":"IFERROR(VLOOKUP(ROWS($AE$2:AE350),P350:Q1098,2,0),\"\")","v":""},null,null,null,null,{"$f":"IFERROR(VLOOKUP(ROWS(AJ$2:$AJ350),O350:Q1098,3,0),\"\")","v":""},null,{"$f":"IFERROR(VLOOKUP(ROWS(AL$2:$AL350),N350:Q1098,4,0),\"\")","v":""}]
[null,null,null,null,null,null,null,null,null,null,null,null,null,0,0,0,"ING Latin America Equity",8123,null,null,null,null,null,null,null,null,null,null,null,null,{"$f":"IFERROR(VLOOKUP(ROWS($AE$2:AE351),P351:Q1099,2,0),\"\")","v":""},null,null,null,null,{"$f":"IFERROR(VLOOKUP(ROWS(AJ$2:$AJ351),O351:Q1099,3,0),\"\")","v":""},null,{"$f":"IFERROR(VLOOKUP(ROWS(AL$2:$AL351),N351:Q1099,4,0),\"\")","v":""}]
[null,null,null,null,null,null,null,null,null,null,null,null,null,0,0,0,"ING Latin America Equity Direct",17104,null,null,null,null,null,null,null,null,null,null,null,null,{"$f":"IFERROR(VLOOKUP(ROWS($AE$2:AE352),P352:Q1100,2,0),\"\")","v":""},null,null,null,null,{"$f":"IFERROR(VLOOKUP(ROWS(AJ$2:$AJ352),O352:Q1100,3,0),\"\")","v":""},null,{"$f":"IFERROR(VLOOKUP(ROWS(AL$2:$AL352),N352:Q1100,4,0),\"\")","v":""}]
[null,null,null,null,null,null,null,null,null,null,null,null,null,0,0,0,"ING Midcap",2742,null,null,null,null,null,null,null,null,null,null,null,null,{"$f":"IFERROR(VLOOKUP(ROWS($AE$2:AE353),P353:Q1101,2,0),\"\")","v":""},null,null,null,null,{"$f":"IFERROR(VLOOKUP(ROWS(AJ$2:$AJ353),O353:Q1101,3,0),\"\")","v":""},null,{"$f":"IFERROR(VLOOKUP(ROWS(AL$2:$AL353),N353:Q1101,4,0),\"\")","v":""}]
[null,null,null,null,null,null,null,null,null,null,null,null,null,0,0,0,"ING Midcap Direct",16931,null,null,null,null,null,null,null,null,null,null,null,null,{"$f":"IFERROR(VLOOKUP(ROWS($AE$2:AE354),P354:Q1102,2,0),\"\")","v":""},null,null,null,null,{"$f":"IFERROR(VLOOKUP(ROWS(AJ$2:$AJ354),O354:Q1102,3,0),\"\")","v":""},null,{"$f":"IFERROR(VLOOKUP(ROWS(AL$2:$AL354),N354:Q1102,4,0),\"\")","v":""}]
[null,null,null,null,null,null,null,null,null,null,null,null,null,0,0,0,"ING OptiMix 5 Star Multi Manager FoF",4154,null,null,null,null,null,null,null,null,null,null,null,null,{"$f":"IFERROR(VLOOKUP(ROWS($AE$2:AE355),P355:Q1103,2,0),\"\")","v":""},null,null,null,null,{"$f":"IFERROR(VLOOKUP(ROWS(AJ$2:$AJ355),O355:Q1103,3,0),\"\")","v":""},null,{"$f":"IFERROR(VLOOKUP(ROWS(AL$2:$AL355),N355:Q1103,4,0),\"\")","v":""}]
[null,null,null,null,null,null,null,null,null,null,null,null,null,0,0,0,"ING OptiMix 5 Star Multi Manager FoF Direct",16876,null,null,null,null,null,null,null,null,null,null,null,null,{"$f":"IFERROR(VLOOKUP(ROWS($AE$2:AE356),P356:Q1104,2,0),\"\")","v":""},null,null,null,null,{"$f":"IFERROR(VLOOKUP(ROWS(AJ$2:$AJ356),O356:Q1104,3,0),\"\")","v":""},null,{"$f":"IFERROR(VLOOKUP(ROWS(AL$2:$AL356),N356:Q1104,4,0),\"\")","v":""}]
[null,null,null,null,null,null,null,null,null,null,null,null,null,0,0,0,"ING OptiMix Global Commodities",8751,null,null,null,null,null,null,null,null,null,null,null,null,{"$f":"IFERROR(VLOOKUP(ROWS($AE$2:AE357),P357:Q1105,2,0),\"\")","v":""},null,null,null,null,{"$f":"IFERROR(VLOOKUP(ROWS(AJ$2:$AJ357),O357:Q1105,3,0),\"\")","v":""},null,{"$f":"IFERROR(VLOOKUP(ROWS(AL$2:$AL357),N357:Q1105,4,0),\"\")","v":""}]
[null,null,null,null,null,null,null,null,null,null,null,null,null,0,0,0,"ING OptiMix Global Commodities Direct",17094,null,null,null,null,null,null,null,null,null,null,null,null,{"$f":"IFERROR(VLOOKUP(ROWS($AE$2:AE358),P358:Q1106,2,0),\"\")","v":""},null,null,null,null,{"$f":"IFERROR(VLOOKUP(ROWS(AJ$2:$AJ358),O358:Q1106,3,0),\"\")","v":""},null,{"$f":"IFERROR(VLOOKUP(ROWS(AL$2:$AL358),N358:Q1106,4,0),\"\")","v":""}]
[null,null,null,null,null,null,null,null,null,null,null,null,null,0,0,0,"ING OptiMix Multi Manager Equity Option A",4553,null,null,null,null,null,null,null,null,null,null,null,null,{"$f":"IFERROR(VLOOKUP(ROWS($AE$2:AE359),P359:Q1107,2,0),\"\")","v":""},null,null,null,null,{"$f":"IFERROR(VLOOKUP(ROWS(AJ$2:$AJ359),O359:Q1107,3,0),\"\")","v":""},null,{"$f":"IFERROR(VLOOKUP(ROWS(AL$2:$AL359),N359:Q1107,4,0),\"\")","v":""}]
[null,null,null,null,null,null,null,null,null,null,null,null,null,0,0,0,"ING OptiMix Multi Manager Equity Option A Direct",16927,null,null,null,null,null,null,null,null,null,null,null,null,{"$f":"IFERROR(VLOOKUP(ROWS($AE$2:AE360),P360:Q1108,2,0),\"\")","v":""},null,null,null,null,{"$f":"IFERROR(VLOOKUP(ROWS(AJ$2:$AJ360),O360:Q1108,3,0),\"\")","v":""},null,{"$f":"IFERROR(VLOOKUP(ROWS(AL$2:$AL360),N360:Q1108,4,0),\"\")","v":""}]
[null,null,null,null,null,null,null,null,null,null,null,null,null,0,0,0,"ING Tax Savings",2127,null,null,null,null,null,null,null,null,null,null,null,null,{"$f":"IFERROR(VLOOKUP(ROWS($AE$2:AE361),P361:Q1109,2,0),\"\")","v":""},null,null,null,null,{"$f":"IFERROR(VLOOKUP(ROWS(AJ$2:$AJ361),O361:Q1109,3,0),\"\")","v":""},null,{"$f":"IFERROR(VLOOKUP(ROWS(AL$2:$AL361),N361:Q1109,4,0),\"\")","v":""}]
[null,null,null,null,null,null,null,null,null,null,null,null,null,0,0,0,"ING Tax Savings Direct",16910,null,null,null,null,null,null,null,null,null,null,null,null,{"$f":"IFERROR(VLOOKUP(ROWS($AE$2:AE362),P362:Q1110,2,0),\"\")","v":""},null,null,null,null,{"$f":"IFERROR(VLOOKUP(ROWS(AJ$2:$AJ362),O362:Q1110,3,0),\"\")","v":""},null,{"$f":"IFERROR(VLOOKUP(ROWS(AL$2:$AL362),N362:Q1110,4,0),\"\")","v":""}]
[null,null,null,null,null,null,null,null,null,null,null,null,null,0,0,0,"ING Tax Savings Direct",16918,null,null,null,null,null,null,null,null,null,null,null,null,{"$f":"IFERROR(VLOOKUP(ROWS($AE$2:AE363),P363:Q1111,2,0),\"\")","v":""},null,null,null,null,{"$f":"IFERROR(VLOOKUP(ROWS(AJ$2:$AJ363),O363:Q1111,3,0),\"\")","v":""},null,{"$f":"IFERROR(VLOOKUP(ROWS(AL$2:$AL363),N363:Q1111,4,0),\"\")","v":""}]
[null,null,null,null,null,null,null,null,null,null,null,null,null,0,0,0,"JM Basic",3157,null,null,null,null,null,null,null,null,null,null,null,null,{"$f":"IFERROR(VLOOKUP(ROWS($AE$2:AE364),P364:Q1112,2,0),\"\")","v":""},null,null,null,null,{"$f":"IFERROR(VLOOKUP(ROWS(AJ$2:$AJ364),O364:Q1112,3,0),\"\")","v":""},null,{"$f":"IFERROR(VLOOKUP(ROWS(AL$2:$AL364),N364:Q1112,4,0),\"\")","v":""}]
[null,null,null,null,null,null,null,null,null,null,null,null,null,0,0,0,"JM Basic Direct",16530,null,null,null,null,null,null,null,null,null,null,null,null,{"$f":"IFERROR(VLOOKUP(ROWS($AE$2:AE365),P365:Q1113,2,0),\"\")","v":""},null,null,null,null,{"$f":"IFERROR(VLOOKUP(ROWS(AJ$2:$AJ365),O365:Q1113,3,0),\"\")","v":""},null,{"$f":"IFERROR(VLOOKUP(ROWS(AL$2:$AL365),N365:Q1113,4,0),\"\")","v":""}]
[null,null,null,null,null,null,null,null,null,null,null,null,null,0,0,0,"JM Core 11",6673,null,null,null,null,null,null,null,null,null,null,null,null,{"$f":"IFERROR(VLOOKUP(ROWS($AE$2:AE366),P366:Q1114,2,0),\"\")","v":""},null,null,null,null,{"$f":"IFERROR(VLOOKUP(ROWS(AJ$2:$AJ366),O366:Q1114,3,0),\"\")","v":""},null,{"$f":"IFERROR(VLOOKUP(ROWS(AL$2:$AL366),N366:Q1114,4,0),\"\")","v":""}]
[null,null,null,null,null,null,null,null,null,null,null,null,null,0,0,0,"JM Core 11 Direct",16539,null,null,null,null,null,null,null,null,null,null,null,null,{"$f":"IFERROR(VLOOKUP(ROWS($AE$2:AE367),P367:Q1115,2,0),\"\")","v":""},null,null,null,null,{"$f":"IFERROR(VLOOKUP(ROWS(AJ$2:$AJ367),O367:Q1115,3,0),\"\")","v":""},null,{"$f":"IFERROR(VLOOKUP(ROWS(AL$2:$AL367),N367:Q1115,4,0),\"\")","v":""}]
[null,null,null,null,null,null,null,null,null,null,null,null,null,0,0,0,"JM Equity",108,null,null,null,null,null,null,null,null,null,null,null,null,{"$f":"IFERROR(VLOOKUP(ROWS($AE$2:AE368),P368:Q1116,2,0),\"\")","v":""},null,null,null,null,{"$f":"IFERROR(VLOOKUP(ROWS(AJ$2:$AJ368),O368:Q1116,3,0),\"\")","v":""},null,{"$f":"IFERROR(VLOOKUP(ROWS(AL$2:$AL368),N368:Q1116,4,0),\"\")","v":""}]
[null,null,null,null,null,null,null,null,null,null,null,null,null,0,0,0,"JM Equity Direct",16541,null,null,null,null,null,null,null,null,null,null,null,null,{"$f":"IFERROR(VLOOKUP(ROWS($AE$2:AE369),P369:Q1117,2,0),\"\")","v":""},null,null,null,null,{"$f":"IFERROR(VLOOKUP(ROWS(AJ$2:$AJ369),O369:Q1117,3,0),\"\")","v":""},null,{"$f":"IFERROR(VLOOKUP(ROWS(AL$2:$AL369),N369:Q1117,4,0),\"\")","v":""}]
[null,null,null,null,null,null,null,null,null,null,null,null,null,0,0,0,"JM Multi Strategy",8653,null,null,null,null,null,null,null,null,null,null,null,null,{"$f":"IFERROR(VLOOKUP(ROWS($AE$2:AE370),P370:Q1118,2,0),\"\")","v":""},null,null,null,null,{"$f":"IFERROR(VLOOKUP(ROWS(AJ$2:$AJ370),O370:Q1118,3,0),\"\")","v":""},null,{"$f":"IFERROR(VLOOKUP(ROWS(AL$2:$AL370),N370:Q1118,4,0),\"\")","v":""}]
[null,null,null,null,null,null,null,null,null,null,null,null,null,0,0,0,"JM Multi Strategy Direct",16547,null,null,null,null,null,null,null,null,null,null,null,null,{"$f":"IFERROR(VLOOKUP(ROWS($AE$2:AE371),P371:Q1119,2,0),\"\")","v":""},null,null,null,null,{"$f":"IFERROR(VLOOKUP(ROWS(AJ$2:$AJ371),O371:Q1119,3,0),\"\")","v":""},null,{"$f":"IFERROR(VLOOKUP(ROWS(AL$2:$AL371),N371:Q1119,4,0),\"\")","v":""}]
[null,null,null,null,null,null,null,null,null,null,null,null,null,0,0,0,"JM Tax Gain",6679,null,null,null,null,null,null,null,null,null,null,null,null,{"$f":"IFERROR(VLOOKUP(ROWS($AE$2:AE372),P372:Q1120,2,0),\"\")","v":""},null,null,null,null,{"$f":"IFERROR(VLOOKUP(ROWS(AJ$2:$AJ372),O372:Q1120,3,0),\"\")","v":""},null,{"$f":"IFERROR(VLOOKUP(ROWS(AL$2:$AL372),N372:Q1120,4,0),\"\")","v":""}]
[null,null,null,null,null,null,null,null,null,null,null,null,null,0,0,0,"JM Tax Gain Direct",16552,null,null,null,null,null,null,null,null,null,null,null,null,{"$f":"IFERROR(VLOOKUP(ROWS($AE$2:AE373),P373:Q1121,2,0),\"\")","v":""},null,null,null,null,{"$f":"IFERROR(VLOOKUP(ROWS(AJ$2:$AJ373),O373:Q1121,3,0),\"\")","v":""},null,{"$f":"IFERROR(VLOOKUP(ROWS(AL$2:$AL373),N373:Q1121,4,0),\"\")","v":""}]
[null,null,null,null,null,null,null,null,null,null,null,null,null,0,0,0,"JP Morgan ASEAN Equity Off Shore",12762,null,null,null,null,null,null,null,null,null,null,null,null,{"$f":"IFERROR(VLOOKUP(ROWS($AE$2:AE374),P374:Q1122,2,0),\"\")","v":""},null,null,null,null,{"$f":"IFERROR(VLOOKUP(ROWS(AJ$2:$AJ374),O374:Q1122,3,0),\"\")","v":""},null,{"$f":"IFERROR(VLOOKUP(ROWS(AL$2:$AL374),N374:Q1122,4,0),\"\")","v":""}]
[null,null,null,null,null,null,null,null,null,null,null,null,null,0,0,0,"JP Morgan ASEAN Equity Off Shore Direct",17131,null,null,null,null,null,null,null,null,null,null,null,null,{"$f":"IFERROR(VLOOKUP(ROWS($AE$2:AE375),P375:Q1123,2,0),\"\")","v":""},null,null,null,null,{"$f":"IFERROR(VLOOKUP(ROWS(AJ$2:$AJ375),O375:Q1123,3,0),\"\")","v":""},null,{"$f":"IFERROR(VLOOKUP(ROWS(AL$2:$AL375),N375:Q1123,4,0),\"\")","v":""}]
[null,null,null,null,null,null,null,null,null,null,null,null,null,0,0,0,"JP Morgan Emerging Eu Mid East and Afr Eqt Off Shore",11691,null,null,null,null,null,null,null,null,null,null,null,null,{"$f":"IFERROR(VLOOKUP(ROWS($AE$2:AE376),P376:Q1124,2,0),\"\")","v":""},null,null,null,null,{"$f":"IFERROR(VLOOKUP(ROWS(AJ$2:$AJ376),O376:Q1124,3,0),\"\")","v":""},null,{"$f":"IFERROR(VLOOKUP(ROWS(AL$2:$AL376),N376:Q1124,4,0),\"\")","v":""}]
[null,null,null,null,null,null,null,null,null,null,null,null,null,0,0,0,"JP Morgan Emerging Eu Mid East and Afr Eqt Off Shore Direct",17127,null,null,null,null,null,null,null,null,null,null,null,null,{"$f":"IFERROR(VLOOKUP(ROWS($AE$2:AE377),P377:Q1125,2,0),\"\")","v":""},null,null,null,null,{"$f":"IFERROR(VLOOKUP(ROWS(AJ$2:$AJ377),O377:Q1125,3,0),\"\")","v":""},null,{"$f":"IFERROR(VLOOKUP(ROWS(AL$2:$AL377),N377:Q1125,4,0),\"\")","v":""}]
[null,null,null,null,null,null,null,null,null,null,null,null,null,0,0,0,"JP Morgan Greater China Equity Off-shore",10567,null,null,null,null,null,null,null,null,null,null,null,null,{"$f":"IFERROR(VLOOKUP(ROWS($AE$2:AE378),P378:Q1126,2,0),\"\")","v":""},null,null,null,null,{"$f":"IFERROR(VLOOKUP(ROWS(AJ$2:$AJ378),O378:Q1126,3,0),\"\")","v":""},null,{"$f":"IFERROR(VLOOKUP(ROWS(AL$2:$AL378),N378:Q1126,4,0),\"\")","v":""}]
[null,null,null,null,null,null,null,null,null,null,null,null,null,0,0,0,"JP Morgan Greater China Equity Off-shore Direct",17132,null,null,null,null,null,null,null,null,null,null,null,null,{"$f":"IFERROR(VLOOKUP(ROWS($AE$2:AE379),P379:Q1127,2,0),\"\")","v":""},null,null,null,null,{"$f":"IFERROR(VLOOKUP(ROWS(AJ$2:$AJ379),O379:Q1127,3,0),\"\")","v":""},null,{"$f":"IFERROR(VLOOKUP(ROWS(AL$2:$AL379),N379:Q1127,4,0),\"\")","v":""}]
[null,null,null,null,null,null,null,null,null,null,null,null,null,0,0,0,"JP Morgan India Equity",4871,null,null,null,null,null,null,null,null,null,null,null,null,{"$f":"IFERROR(VLOOKUP(ROWS($AE$2:AE380),P380:Q1128,2,0),\"\")","v":""},null,null,null,null,{"$f":"IFERROR(VLOOKUP(ROWS(AJ$2:$AJ380),O380:Q1128,3,0),\"\")","v":""},null,{"$f":"IFERROR(VLOOKUP(ROWS(AL$2:$AL380),N380:Q1128,4,0),\"\")","v":""}]
[null,null,null,null,null,null,null,null,null,null,null,null,null,0,0,0,"JP Morgan India Equity Direct",16569,null,null,null,null,null,null,null,null,null,null,null,null,{"$f":"IFERROR(VLOOKUP(ROWS($AE$2:AE381),P381:Q1129,2,0),\"\")","v":""},null,null,null,null,{"$f":"IFERROR(VLOOKUP(ROWS(AJ$2:$AJ381),O381:Q1129,3,0),\"\")","v":""},null,{"$f":"IFERROR(VLOOKUP(ROWS(AL$2:$AL381),N381:Q1129,4,0),\"\")","v":""}]
[null,null,null,null,null,null,null,null,null,null,null,null,null,0,0,0,"JP Morgan India Smaller Companies",6227,null,null,null,null,null,null,null,null,null,null,null,null,{"$f":"IFERROR(VLOOKUP(ROWS($AE$2:AE382),P382:Q1130,2,0),\"\")","v":""},null,null,null,null,{"$f":"IFERROR(VLOOKUP(ROWS(AJ$2:$AJ382),O382:Q1130,3,0),\"\")","v":""},null,{"$f":"IFERROR(VLOOKUP(ROWS(AL$2:$AL382),N382:Q1130,4,0),\"\")","v":""}]
[null,null,null,null,null,null,null,null,null,null,null,null,null,0,0,0,"JP Morgan India Smaller Companies Direct",16586,null,null,null,null,null,null,null,null,null,null,null,null,{"$f":"IFERROR(VLOOKUP(ROWS($AE$2:AE383),P383:Q1131,2,0),\"\")","v":""},null,null,null,null,{"$f":"IFERROR(VLOOKUP(ROWS(AJ$2:$AJ383),O383:Q1131,3,0),\"\")","v":""},null,{"$f":"IFERROR(VLOOKUP(ROWS(AL$2:$AL383),N383:Q1131,4,0),\"\")","v":""}]
[null,null,null,null,null,null,null,null,null,null,null,null,null,0,0,0,"JP Morgan India Tax Advantage",10095,null,null,null,null,null,null,null,null,null,null,null,null,{"$f":"IFERROR(VLOOKUP(ROWS($AE$2:AE384),P384:Q1132,2,0),\"\")","v":""},null,null,null,null,{"$f":"IFERROR(VLOOKUP(ROWS(AJ$2:$AJ384),O384:Q1132,3,0),\"\")","v":""},null,{"$f":"IFERROR(VLOOKUP(ROWS(AL$2:$AL384),N384:Q1132,4,0),\"\")","v":""}]
[null,null,null,null,null,null,null,null,null,null,null,null,null,0,0,0,"JP Morgan India Tax Advantage Direct",16592,null,null,null,null,null,null,null,null,null,null,null,null,{"$f":"IFERROR(VLOOKUP(ROWS($AE$2:AE385),P385:Q1133,2,0),\"\")","v":""},null,null,null,null,{"$f":"IFERROR(VLOOKUP(ROWS(AJ$2:$AJ385),O385:Q1133,3,0),\"\")","v":""},null,{"$f":"IFERROR(VLOOKUP(ROWS(AL$2:$AL385),N385:Q1133,4,0),\"\")","v":""}]
[null,null,null,null,null,null,null,null,null,null,null,null,null,0,0,{"$f":"IF(ISNUMBER(SEARCH($H$6,Q386)),MAX($P$1,P385)+1,0)","v":0},"JP Morgan US Value Equity Offshore Direct",20060,null,null,null,null,null,null,null,null,null,null,null,null,{"$f":"IFERROR(VLOOKUP(ROWS($AE$2:AE386),P386:Q1134,2,0),\"\")","v":""},null,null,null,null,{"$f":"IFERROR(VLOOKUP(ROWS(AJ$2:$AJ386),O386:Q1134,3,0),\"\")","v":""},null,{"$f":"IFERROR(VLOOKUP(ROWS(AL$2:$AL386),N386:Q1134,4,0),\"\")","v":""}]
[null,null,null,null,null,null,null,null,null,null,null,null,null,{"$f":"IF(ISNUMBER(SEARCH($H$16,Q387)),MAX($N$1,N386)+1,0)","v":0},{"$f":"IF(ISNUMBER(SEARCH($H$11,Q387)),MAX($O$1,O386)+1,0)","v":0},0,"JP Morgan US Value Equity Offshore Reg",20059,null,null,null,null,null,null,null,null,null,null,null,null,{"$f":"IFERROR(VLOOKUP(ROWS($AE$2:AE387),P387:Q1135,2,0),\"\")","v":""},null,null,null,null,{"$f":"IFERROR(VLOOKUP(ROWS(AJ$2:$AJ387),O387:Q1135,3,0),\"\")","v":""},null,{"$f":"IFERROR(VLOOKUP(ROWS(AL$2:$AL387),N387:Q1135,4,0),\"\")","v":""}]
[null,null,null,null,null,null,null,null,null,null,null,null,null,0,0,0,"Kotak 50",577,null,null,null,null,null,null,null,null,null,null,null,null,{"$f":"IFERROR(VLOOKUP(ROWS($AE$2:AE388),P388:Q1136,2,0),\"\")","v":""},null,null,null,null,{"$f":"IFERROR(VLOOKUP(ROWS(AJ$2:$AJ388),O388:Q1136,3,0),\"\")","v":""},null,{"$f":"IFERROR(VLOOKUP(ROWS(AL$2:$AL388),N388:Q1136,4,0),\"\")","v":""}]
[null,null,null,null,null,null,null,null,null,null,null,null,null,0,0,0,"Kotak 50 Direct",16337,null,null,null,null,null,null,null,null,null,null,null,null,{"$f":"IFERROR(VLOOKUP(ROWS($AE$2:AE389),P389:Q1137,2,0),\"\")","v":""},null,null,null,null,{"$f":"IFERROR(VLOOKUP(ROWS(AJ$2:$AJ389),O389:Q1137,3,0),\"\")","v":""},null,{"$f":"IFERROR(VLOOKUP(ROWS(AL$2:$AL389),N389:Q1137,4,0),\"\")","v":""}]
[null,null,null,null,null,null,null,null,null,null,null,null,null,0,0,0,"Kotak Classic Equity",2780,null,null,null,null,null,null,null,null,null,null,null,null,{"$f":"IFERROR(VLOOKUP(ROWS($AE$2:AE390),P390:Q1138,2,0),\"\")","v":""},null,null,null,null,{"$f":"IFERROR(VLOOKUP(ROWS(AJ$2:$AJ390),O390:Q1138,3,0),\"\")","v":""},null,{"$f":"IFERROR(VLOOKUP(ROWS(AL$2:$AL390),N390:Q1138,4,0),\"\")","v":""}]
[null,null,null,null,null,null,null,null,null,null,null,null,null,0,0,0,"Kotak Classic Equity Direct",16341,null,null,null,null,null,null,null,null,null,null,null,null,{"$f":"IFERROR(VLOOKUP(ROWS($AE$2:AE391),P391:Q1139,2,0),\"\")","v":""},null,null,null,null,{"$f":"IFERROR(VLOOKUP(ROWS(AJ$2:$AJ391),O391:Q1139,3,0),\"\")","v":""},null,{"$f":"IFERROR(VLOOKUP(ROWS(AL$2:$AL391),N391:Q1139,4,0),\"\")","v":""}]
[null,null,null,null,null,null,null,null,null,null,null,null,null,0,0,0,"Kotak Emerging Equity",4270,null,null,null,null,null,null,null,null,null,null,null,null,{"$f":"IFERROR(VLOOKUP(ROWS($AE$2:AE392),P392:Q1140,2,0),\"\")","v":""},null,null,null,null,{"$f":"IFERROR(VLOOKUP(ROWS(AJ$2:$AJ392),O392:Q1140,3,0),\"\")","v":""},null,{"$f":"IFERROR(VLOOKUP(ROWS(AL$2:$AL392),N392:Q1140,4,0),\"\")","v":""}]
[null,null,null,null,null,null,null,null,null,null,null,null,null,0,0,0,"Kotak Emerging Equity Direct",17134,null,null,null,null,null,null,null,null,null,null,null,null,{"$f":"IFERROR(VLOOKUP(ROWS($AE$2:AE393),P393:Q1141,2,0),\"\")","v":""},null,null,null,null,{"$f":"IFERROR(VLOOKUP(ROWS(AJ$2:$AJ393),O393:Q1141,3,0),\"\")","v":""},null,{"$f":"IFERROR(VLOOKUP(ROWS(AL$2:$AL393),N393:Q1141,4,0),\"\")","v":""}]
[null,null,null,null,null,null,null,null,null,null,null,null,null,0,0,0,"Kotak Equity FoF",2308,null,null,null,null,null,null,null,null,null,null,null,null,{"$f":"IFERROR(VLOOKUP(ROWS($AE$2:AE394),P394:Q1142,2,0),\"\")","v":""},null,null,null,null,{"$f":"IFERROR(VLOOKUP(ROWS(AJ$2:$AJ394),O394:Q1142,3,0),\"\")","v":""},null,{"$f":"IFERROR(VLOOKUP(ROWS(AL$2:$AL394),N394:Q1142,4,0),\"\")","v":""}]
[null,null,null,null,null,null,null,null,null,null,null,null,null,0,0,0,"Kotak Equity FoF Direct",17436,null,null,null,null,null,null,null,null,null,null,null,null,{"$f":"IFERROR(VLOOKUP(ROWS($AE$2:AE395),P395:Q1143,2,0),\"\")","v":""},null,null,null,null,{"$f":"IFERROR(VLOOKUP(ROWS(AJ$2:$AJ395),O395:Q1143,3,0),\"\")","v":""},null,{"$f":"IFERROR(VLOOKUP(ROWS(AL$2:$AL395),N395:Q1143,4,0),\"\")","v":""}]
[null,null,null,null,null,null,null,null,null,null,null,null,null,0,0,0,"Kotak Global Emerging Market",5560,null,null,null,null,null,null,null,null,null,null,null,null,{"$f":"IFERROR(VLOOKUP(ROWS($AE$2:AE396),P396:Q1144,2,0),\"\")","v":""},null,null,null,null,{"$f":"IFERROR(VLOOKUP(ROWS(AJ$2:$AJ396),O396:Q1144,3,0),\"\")","v":""},null,{"$f":"IFERROR(VLOOKUP(ROWS(AL$2:$AL396),N396:Q1144,4,0),\"\")","v":""}]
[null,null,null,null,null,null,null,null,null,null,null,null,null,0,0,0,"Kotak Global Emerging Market Direct",17439,null,null,null,null,null,null,null,null,null,null,null,null,{"$f":"IFERROR(VLOOKUP(ROWS($AE$2:AE397),P397:Q1145,2,0),\"\")","v":""},null,null,null,null,{"$f":"IFERROR(VLOOKUP(ROWS(AJ$2:$AJ397),O397:Q1145,3,0),\"\")","v":""},null,{"$f":"IFERROR(VLOOKUP(ROWS(AL$2:$AL397),N397:Q1145,4,0),\"\")","v":""}]
[null,null,null,null,null,null,null,null,null,null,null,null,null,0,0,0,"Kotak Mid-Cap",2597,null,null,null,null,null,null,null,null,null,null,null,null,{"$f":"IFERROR(VLOOKUP(ROWS($AE$2:AE398),P398:Q1146,2,0),\"\")","v":""},null,null,null,null,{"$f":"IFERROR(VLOOKUP(ROWS(AJ$2:$AJ398),O398:Q1146,3,0),\"\")","v":""},null,{"$f":"IFERROR(VLOOKUP(ROWS(AL$2:$AL398),N398:Q1146,4,0),\"\")","v":""}]
[null,null,null,null,null,null,null,null,null,null,null,null,null,0,0,0,"Kotak Mid-Cap Direct",16382,null,null,null,null,null,null,null,null,null,null,null,null,{"$f":"IFERROR(VLOOKUP(ROWS($AE$2:AE399),P399:Q1147,2,0),\"\")","v":""},null,null,null,null,{"$f":"IFERROR(VLOOKUP(ROWS(AJ$2:$AJ399),O399:Q1147,3,0),\"\")","v":""},null,{"$f":"IFERROR(VLOOKUP(ROWS(AL$2:$AL399),N399:Q1147,4,0),\"\")","v":""}]
[null,null,null,null,null,null,null,null,null,null,null,null,null,0,0,0,"Kotak Nifty ETF",10843,null,null,null,null,null,null,null,null,null,null,null,null,{"$f":"IFERROR(VLOOKUP(ROWS($AE$2:AE400),P400:Q1148,2,0),\"\")","v":""},null,null,null,null,{"$f":"IFERROR(VLOOKUP(ROWS(AJ$2:$AJ400),O400:Q1148,3,0),\"\")","v":""},null,{"$f":"IFERROR(VLOOKUP(ROWS(AL$2:$AL400),N400:Q1148,4,0),\"\")","v":""}]
[null,null,null,null,null,null,null,null,null,null,null,null,null,0,0,0,"Kotak Opportunities",2360,null,null,null,null,null,null,null,null,null,null,null,null,{"$f":"IFERROR(VLOOKUP(ROWS($AE$2:AE401),P401:Q1149,2,0),\"\")","v":""},null,null,null,null,{"$f":"IFERROR(VLOOKUP(ROWS(AJ$2:$AJ401),O401:Q1149,3,0),\"\")","v":""},null,{"$f":"IFERROR(VLOOKUP(ROWS(AL$2:$AL401),N401:Q1149,4,0),\"\")","v":""}]
[null,null,null,null,null,null,null,null,null,null,null,null,null,0,0,0,"Kotak Opportunities Direct",16378,null,null,null,null,null,null,null,null,null,null,null,null,{"$f":"IFERROR(VLOOKUP(ROWS($AE$2:AE402),P402:Q1150,2,0),\"\")","v":""},null,null,null,null,{"$f":"IFERROR(VLOOKUP(ROWS(AJ$2:$AJ402),O402:Q1150,3,0),\"\")","v":""},null,{"$f":"IFERROR(VLOOKUP(ROWS(AL$2:$AL402),N402:Q1150,4,0),\"\")","v":""}]
[null,null,null,null,null,null,null,null,null,null,null,null,null,0,0,0,"Kotak PSU Bank ETF",6157,null,null,null,null,null,null,null,null,null,null,null,null,{"$f":"IFERROR(VLOOKUP(ROWS($AE$2:AE403),P403:Q1151,2,0),\"\")","v":""},null,null,null,null,{"$f":"IFERROR(VLOOKUP(ROWS(AJ$2:$AJ403),O403:Q1151,3,0),\"\")","v":""},null,{"$f":"IFERROR(VLOOKUP(ROWS(AL$2:$AL403),N403:Q1151,4,0),\"\")","v":""}]
[null,null,null,null,null,null,null,null,null,null,null,null,null,0,0,0,"Kotak Select Focus",10594,null,null,null,null,null,null,null,null,null,null,null,null,{"$f":"IFERROR(VLOOKUP(ROWS($AE$2:AE404),P404:Q1152,2,0),\"\")","v":""},null,null,null,null,{"$f":"IFERROR(VLOOKUP(ROWS(AJ$2:$AJ404),O404:Q1152,3,0),\"\")","v":""},null,{"$f":"IFERROR(VLOOKUP(ROWS(AL$2:$AL404),N404:Q1152,4,0),\"\")","v":""}]
[null,null,null,null,null,null,null,null,null,null,null,null,null,0,0,0,"Kotak Select Focus Direct",17140,null,null,null,null,null,null,null,null,null,null,null,null,{"$f":"IFERROR(VLOOKUP(ROWS($AE$2:AE405),P405:Q1153,2,0),\"\")","v":""},null,null,null,null,{"$f":"IFERROR(VLOOKUP(ROWS(AJ$2:$AJ405),O405:Q1153,3,0),\"\")","v":""},null,{"$f":"IFERROR(VLOOKUP(ROWS(AL$2:$AL405),N405:Q1153,4,0),\"\")","v":""}]
[null,null,null,null,null,null,null,null,null,null,null,null,null,0,0,0,"Kotak Sensex ETF",7780,null,null,null,null,null,null,null,null,null,null,null,null,{"$f":"IFERROR(VLOOKUP(ROWS($AE$2:AE406),P406:Q1154,2,0),\"\")","v":""},null,null,null,null,{"$f":"IFERROR(VLOOKUP(ROWS(AJ$2:$AJ406),O406:Q1154,3,0),\"\")","v":""},null,{"$f":"IFERROR(VLOOKUP(ROWS(AL$2:$AL406),N406:Q1154,4,0),\"\")","v":""}]
[null,null,null,null,null,null,null,null,null,null,null,null,null,0,0,0,"Kotak Tax Saver",2937,null,null,null,null,null,null,null,null,null,null,null,null,{"$f":"IFERROR(VLOOKUP(ROWS($AE$2:AE407),P407:Q1155,2,0),\"\")","v":""},null,null,null,null,{"$f":"IFERROR(VLOOKUP(ROWS(AJ$2:$AJ407),O407:Q1155,3,0),\"\")","v":""},null,{"$f":"IFERROR(VLOOKUP(ROWS(AL$2:$AL407),N407:Q1155,4,0),\"\")","v":""}]
[null,null,null,null,null,null,null,null,null,null,null,null,null,0,0,0,"Kotak Tax Saver Direct",16380,null,null,null,null,null,null,null,null,null,null,null,null,{"$f":"IFERROR(VLOOKUP(ROWS($AE$2:AE408),P408:Q1156,2,0),\"\")","v":""},null,null,null,null,{"$f":"IFERROR(VLOOKUP(ROWS(AJ$2:$AJ408),O408:Q1156,3,0),\"\")","v":""},null,{"$f":"IFERROR(VLOOKUP(ROWS(AL$2:$AL408),N408:Q1156,4,0),\"\")","v":""}]
[null,null,null,null,null,null,null,null,null,null,null,null,null,0,0,0,"L&T Equity",2686,null,null,null,null,null,null,null,null,null,null,null,null,{"$f":"IFERROR(VLOOKUP(ROWS($AE$2:AE409),P409:Q1157,2,0),\"\")","v":""},null,null,null,null,{"$f":"IFERROR(VLOOKUP(ROWS(AJ$2:$AJ409),O409:Q1157,3,0),\"\")","v":""},null,{"$f":"IFERROR(VLOOKUP(ROWS(AL$2:$AL409),N409:Q1157,4,0),\"\")","v":""}]
[null,null,null,null,null,null,null,null,null,null,null,null,null,0,0,0,"L&T Equity Direct",16212,null,null,null,null,null,null,null,null,null,null,null,null,{"$f":"IFERROR(VLOOKUP(ROWS($AE$2:AE410),P410:Q1158,2,0),\"\")","v":""},null,null,null,null,{"$f":"IFERROR(VLOOKUP(ROWS(AJ$2:$AJ410),O410:Q1158,3,0),\"\")","v":""},null,{"$f":"IFERROR(VLOOKUP(ROWS(AL$2:$AL410),N410:Q1158,4,0),\"\")","v":""}]
[null,null,null,null,null,null,null,null,null,null,null,null,null,0,0,0,"L&T Global Real Assets",10859,null,null,null,null,null,null,null,null,null,null,null,null,{"$f":"IFERROR(VLOOKUP(ROWS($AE$2:AE411),P411:Q1159,2,0),\"\")","v":""},null,null,null,null,{"$f":"IFERROR(VLOOKUP(ROWS(AJ$2:$AJ411),O411:Q1159,3,0),\"\")","v":""},null,{"$f":"IFERROR(VLOOKUP(ROWS(AL$2:$AL411),N411:Q1159,4,0),\"\")","v":""}]
[null,null,null,null,null,null,null,null,null,null,null,null,null,0,0,0,"L&T Global Real Assets Direct",16243,null,null,null,null,null,null,null,null,null,null,null,null,{"$f":"IFERROR(VLOOKUP(ROWS($AE$2:AE412),P412:Q1160,2,0),\"\")","v":""},null,null,null,null,{"$f":"IFERROR(VLOOKUP(ROWS(AJ$2:$AJ412),O412:Q1160,3,0),\"\")","v":""},null,{"$f":"IFERROR(VLOOKUP(ROWS(AL$2:$AL412),N412:Q1160,4,0),\"\")","v":""}]
[null,null,null,null,null,null,null,null,null,null,null,null,null,0,0,0,"L&T India Large Cap",5707,null,null,null,null,null,null,null,null,null,null,null,null,{"$f":"IFERROR(VLOOKUP(ROWS($AE$2:AE413),P413:Q1161,2,0),\"\")","v":""},null,null,null,null,{"$f":"IFERROR(VLOOKUP(ROWS(AJ$2:$AJ413),O413:Q1161,3,0),\"\")","v":""},null,{"$f":"IFERROR(VLOOKUP(ROWS(AL$2:$AL413),N413:Q1161,4,0),\"\")","v":""}]
[null,null,null,null,null,null,null,null,null,null,null,null,null,0,0,0,"L&T India Large Cap Direct",16256,null,null,null,null,null,null,null,null,null,null,null,null,{"$f":"IFERROR(VLOOKUP(ROWS($AE$2:AE414),P414:Q1162,2,0),\"\")","v":""},null,null,null,null,{"$f":"IFERROR(VLOOKUP(ROWS(AJ$2:$AJ414),O414:Q1162,3,0),\"\")","v":""},null,{"$f":"IFERROR(VLOOKUP(ROWS(AL$2:$AL414),N414:Q1162,4,0),\"\")","v":""}]
[null,null,null,null,null,null,null,null,null,null,null,null,null,0,0,0,"L&T India Special Situations",3326,null,null,null,null,null,null,null,null,null,null,null,null,{"$f":"IFERROR(VLOOKUP(ROWS($AE$2:AE415),P415:Q1163,2,0),\"\")","v":""},null,null,null,null,{"$f":"IFERROR(VLOOKUP(ROWS(AJ$2:$AJ415),O415:Q1163,3,0),\"\")","v":""},null,{"$f":"IFERROR(VLOOKUP(ROWS(AL$2:$AL415),N415:Q1163,4,0),\"\")","v":""}]
[null,null,null,null,null,null,null,null,null,null,null,null,null,0,0,0,"L&T India Special Situations Direct",16266,null,null,null,null,null,null,null,null,null,null,null,null,{"$f":"IFERROR(VLOOKUP(ROWS($AE$2:AE416),P416:Q1164,2,0),\"\")","v":""},null,null,null,null,{"$f":"IFERROR(VLOOKUP(ROWS(AJ$2:$AJ416),O416:Q1164,3,0),\"\")","v":""},null,{"$f":"IFERROR(VLOOKUP(ROWS(AL$2:$AL416),N416:Q1164,4,0),\"\")","v":""}]
[null,null,null,null,null,null,null,null,null,null,null,null,null,0,0,0,"L&T India Value",10789,null,null,null,null,null,null,null,null,null,null,null,null,{"$f":"IFERROR(VLOOKUP(ROWS($AE$2:AE417),P417:Q1165,2,0),\"\")","v":""},null,null,null,null,{"$f":"IFERROR(VLOOKUP(ROWS(AJ$2:$AJ417),O417:Q1165,3,0),\"\")","v":""},null,{"$f":"IFERROR(VLOOKUP(ROWS(AL$2:$AL417),N417:Q1165,4,0),\"\")","v":""}]
[null,null,null,null,null,null,null,null,null,null,null,null,null,0,0,0,"L&T India Value Direct",16269,null,null,null,null,null,null,null,null,null,null,null,null,{"$f":"IFERROR(VLOOKUP(ROWS($AE$2:AE418),P418:Q1166,2,0),\"\")","v":""},null,null,null,null,{"$f":"IFERROR(VLOOKUP(ROWS(AJ$2:$AJ418),O418:Q1166,3,0),\"\")","v":""},null,{"$f":"IFERROR(VLOOKUP(ROWS(AL$2:$AL418),N418:Q1166,4,0),\"\")","v":""}]
[null,null,null,null,null,null,null,null,null,null,null,null,null,0,0,0,"L&T Indo Asia",4836,null,null,null,null,null,null,null,null,null,null,null,null,{"$f":"IFERROR(VLOOKUP(ROWS($AE$2:AE419),P419:Q1167,2,0),\"\")","v":""},null,null,null,null,{"$f":"IFERROR(VLOOKUP(ROWS(AJ$2:$AJ419),O419:Q1167,3,0),\"\")","v":""},null,{"$f":"IFERROR(VLOOKUP(ROWS(AL$2:$AL419),N419:Q1167,4,0),\"\")","v":""}]
[null,null,null,null,null,null,null,null,null,null,null,null,null,0,0,0,"L&T Indo Asia Direct",16272,null,null,null,null,null,null,null,null,null,null,null,null,{"$f":"IFERROR(VLOOKUP(ROWS($AE$2:AE420),P420:Q1168,2,0),\"\")","v":""},null,null,null,null,{"$f":"IFERROR(VLOOKUP(ROWS(AJ$2:$AJ420),O420:Q1168,3,0),\"\")","v":""},null,{"$f":"IFERROR(VLOOKUP(ROWS(AL$2:$AL420),N420:Q1168,4,0),\"\")","v":""}]
[null,null,null,null,null,null,null,null,null,null,null,null,null,0,0,0,"L&T Infrastructure",5564,null,null,null,null,null,null,null,null,null,null,null,null,{"$f":"IFERROR(VLOOKUP(ROWS($AE$2:AE421),P421:Q1169,2,0),\"\")","v":""},null,null,null,null,{"$f":"IFERROR(VLOOKUP(ROWS(AJ$2:$AJ421),O421:Q1169,3,0),\"\")","v":""},null,{"$f":"IFERROR(VLOOKUP(ROWS(AL$2:$AL421),N421:Q1169,4,0),\"\")","v":""}]
[null,null,null,null,null,null,null,null,null,null,null,null,null,0,0,0,"L&T Infrastructure Direct",16275,null,null,null,null,null,null,null,null,null,null,null,null,{"$f":"IFERROR(VLOOKUP(ROWS($AE$2:AE422),P422:Q1170,2,0),\"\")","v":""},null,null,null,null,{"$f":"IFERROR(VLOOKUP(ROWS(AJ$2:$AJ422),O422:Q1170,3,0),\"\")","v":""},null,{"$f":"IFERROR(VLOOKUP(ROWS(AL$2:$AL422),N422:Q1170,4,0),\"\")","v":""}]
[null,null,null,null,null,null,null,null,null,null,null,null,null,0,0,0,"L&T Midcap",2333,null,null,null,null,null,null,null,null,null,null,null,null,{"$f":"IFERROR(VLOOKUP(ROWS($AE$2:AE423),P423:Q1171,2,0),\"\")","v":""},null,null,null,null,{"$f":"IFERROR(VLOOKUP(ROWS(AJ$2:$AJ423),O423:Q1171,3,0),\"\")","v":""},null,{"$f":"IFERROR(VLOOKUP(ROWS(AL$2:$AL423),N423:Q1171,4,0),\"\")","v":""}]
[null,null,null,null,null,null,null,null,null,null,null,null,null,0,0,0,"L&T Midcap Direct",16280,null,null,null,null,null,null,null,null,null,null,null,null,{"$f":"IFERROR(VLOOKUP(ROWS($AE$2:AE424),P424:Q1172,2,0),\"\")","v":""},null,null,null,null,{"$f":"IFERROR(VLOOKUP(ROWS(AJ$2:$AJ424),O424:Q1172,3,0),\"\")","v":""},null,{"$f":"IFERROR(VLOOKUP(ROWS(AL$2:$AL424),N424:Q1172,4,0),\"\")","v":""}]
[null,null,null,null,null,null,null,null,null,null,null,null,null,0,0,0,"L&T Tax Advantage",3112,null,null,null,null,null,null,null,null,null,null,null,null,{"$f":"IFERROR(VLOOKUP(ROWS($AE$2:AE425),P425:Q1173,2,0),\"\")","v":""},null,null,null,null,{"$f":"IFERROR(VLOOKUP(ROWS(AJ$2:$AJ425),O425:Q1173,3,0),\"\")","v":""},null,{"$f":"IFERROR(VLOOKUP(ROWS(AL$2:$AL425),N425:Q1173,4,0),\"\")","v":""}]
[null,null,null,null,null,null,null,null,null,null,null,null,null,0,0,0,"L&T Tax Advantage Direct",16200,null,null,null,null,null,null,null,null,null,null,null,null,{"$f":"IFERROR(VLOOKUP(ROWS($AE$2:AE426),P426:Q1174,2,0),\"\")","v":""},null,null,null,null,{"$f":"IFERROR(VLOOKUP(ROWS(AJ$2:$AJ426),O426:Q1174,3,0),\"\")","v":""},null,{"$f":"IFERROR(VLOOKUP(ROWS(AL$2:$AL426),N426:Q1174,4,0),\"\")","v":""}]
[null,null,null,null,null,null,null,null,null,null,null,null,null,0,0,0,"L&T Tax Saver",2920,null,null,null,null,null,null,null,null,null,null,null,null,{"$f":"IFERROR(VLOOKUP(ROWS($AE$2:AE427),P427:Q1175,2,0),\"\")","v":""},null,null,null,null,{"$f":"IFERROR(VLOOKUP(ROWS(AJ$2:$AJ427),O427:Q1175,3,0),\"\")","v":""},null,{"$f":"IFERROR(VLOOKUP(ROWS(AL$2:$AL427),N427:Q1175,4,0),\"\")","v":""}]
[null,null,null,null,null,null,null,null,null,null,null,null,null,0,0,0,"LIC Nomura MF Equity",134,null,null,null,null,null,null,null,null,null,null,null,null,{"$f":"IFERROR(VLOOKUP(ROWS($AE$2:AE428),P428:Q1176,2,0),\"\")","v":""},null,null,null,null,{"$f":"IFERROR(VLOOKUP(ROWS(AJ$2:$AJ428),O428:Q1176,3,0),\"\")","v":""},null,{"$f":"IFERROR(VLOOKUP(ROWS(AL$2:$AL428),N428:Q1176,4,0),\"\")","v":""}]
[null,null,null,null,null,null,null,null,null,null,null,null,null,0,0,0,"LIC Nomura MF Equity Direct",16756,null,null,null,null,null,null,null,null,null,null,null,null,{"$f":"IFERROR(VLOOKUP(ROWS($AE$2:AE429),P429:Q1177,2,0),\"\")","v":""},null,null,null,null,{"$f":"IFERROR(VLOOKUP(ROWS(AJ$2:$AJ429),O429:Q1177,3,0),\"\")","v":""},null,{"$f":"IFERROR(VLOOKUP(ROWS(AL$2:$AL429),N429:Q1177,4,0),\"\")","v":""}]
[null,null,null,null,null,null,null,null,null,null,null,null,null,0,0,0,"LIC Nomura MF Growth",158,null,null,null,null,null,null,null,null,null,null,null,null,{"$f":"IFERROR(VLOOKUP(ROWS($AE$2:AE430),P430:Q1178,2,0),\"\")","v":""},null,null,null,null,{"$f":"IFERROR(VLOOKUP(ROWS(AJ$2:$AJ430),O430:Q1178,3,0),\"\")","v":""},null,{"$f":"IFERROR(VLOOKUP(ROWS(AL$2:$AL430),N430:Q1178,4,0),\"\")","v":""}]
[null,null,null,null,null,null,null,null,null,null,null,null,null,0,0,0,"LIC Nomura MF Growth Direct",16781,null,null,null,null,null,null,null,null,null,null,null,null,{"$f":"IFERROR(VLOOKUP(ROWS($AE$2:AE431),P431:Q1179,2,0),\"\")","v":""},null,null,null,null,{"$f":"IFERROR(VLOOKUP(ROWS(AJ$2:$AJ431),O431:Q1179,3,0),\"\")","v":""},null,{"$f":"IFERROR(VLOOKUP(ROWS(AL$2:$AL431),N431:Q1179,4,0),\"\")","v":""}]
[null,null,null,null,null,null,null,null,null,null,null,null,null,0,0,0,"LIC Nomura MF Index Nifty",1478,null,null,null,null,null,null,null,null,null,null,null,null,{"$f":"IFERROR(VLOOKUP(ROWS($AE$2:AE432),P432:Q1180,2,0),\"\")","v":""},null,null,null,null,{"$f":"IFERROR(VLOOKUP(ROWS(AJ$2:$AJ432),O432:Q1180,3,0),\"\")","v":""},null,{"$f":"IFERROR(VLOOKUP(ROWS(AL$2:$AL432),N432:Q1180,4,0),\"\")","v":""}]
[null,null,null,null,null,null,null,null,null,null,null,null,null,0,0,0,"LIC Nomura MF Index Nifty Direct",16763,null,null,null,null,null,null,null,null,null,null,null,null,{"$f":"IFERROR(VLOOKUP(ROWS($AE$2:AE433),P433:Q1181,2,0),\"\")","v":""},null,null,null,null,{"$f":"IFERROR(VLOOKUP(ROWS(AJ$2:$AJ433),O433:Q1181,3,0),\"\")","v":""},null,{"$f":"IFERROR(VLOOKUP(ROWS(AL$2:$AL433),N433:Q1181,4,0),\"\")","v":""}]
[null,null,null,null,null,null,null,null,null,null,null,null,null,0,0,0,"LIC Nomura MF Index Sensex",1479,null,null,null,null,null,null,null,null,null,null,null,null,{"$f":"IFERROR(VLOOKUP(ROWS($AE$2:AE434),P434:Q1182,2,0),\"\")","v":""},null,null,null,null,{"$f":"IFERROR(VLOOKUP(ROWS(AJ$2:$AJ434),O434:Q1182,3,0),\"\")","v":""},null,{"$f":"IFERROR(VLOOKUP(ROWS(AL$2:$AL434),N434:Q1182,4,0),\"\")","v":""}]
[null,null,null,null,null,null,null,null,null,null,null,null,null,0,0,0,"LIC Nomura MF Index Sensex Direct",16798,null,null,null,null,null,null,null,null,null,null,null,null,{"$f":"IFERROR(VLOOKUP(ROWS($AE$2:AE435),P435:Q1183,2,0),\"\")","v":""},null,null,null,null,{"$f":"IFERROR(VLOOKUP(ROWS(AJ$2:$AJ435),O435:Q1183,3,0),\"\")","v":""},null,{"$f":"IFERROR(VLOOKUP(ROWS(AL$2:$AL435),N435:Q1183,4,0),\"\")","v":""}]
[null,null,null,null,null,null,null,null,null,null,null,null,null,0,0,0,"LIC Nomura MF India Vision",3976,null,null,null,null,null,null,null,null,null,null,null,null,{"$f":"IFERROR(VLOOKUP(ROWS($AE$2:AE436),P436:Q1184,2,0),\"\")","v":""},null,null,null,null,{"$f":"IFERROR(VLOOKUP(ROWS(AJ$2:$AJ436),O436:Q1184,3,0),\"\")","v":""},null,{"$f":"IFERROR(VLOOKUP(ROWS(AL$2:$AL436),N436:Q1184,4,0),\"\")","v":""}]
[null,null,null,null,null,null,null,null,null,null,null,null,null,0,0,0,"LIC Nomura MF India Vision Direct",16805,null,null,null,null,null,null,null,null,null,null,null,null,{"$f":"IFERROR(VLOOKUP(ROWS($AE$2:AE437),P437:Q1185,2,0),\"\")","v":""},null,null,null,null,{"$f":"IFERROR(VLOOKUP(ROWS(AJ$2:$AJ437),O437:Q1185,3,0),\"\")","v":""},null,{"$f":"IFERROR(VLOOKUP(ROWS(AL$2:$AL437),N437:Q1185,4,0),\"\")","v":""}]
[null,null,null,null,null,null,null,null,null,null,null,null,null,0,0,0,"LIC Nomura MF Infrastructure",6780,null,null,null,null,null,null,null,null,null,null,null,null,{"$f":"IFERROR(VLOOKUP(ROWS($AE$2:AE438),P438:Q1186,2,0),\"\")","v":""},null,null,null,null,{"$f":"IFERROR(VLOOKUP(ROWS(AJ$2:$AJ438),O438:Q1186,3,0),\"\")","v":""},null,{"$f":"IFERROR(VLOOKUP(ROWS(AL$2:$AL438),N438:Q1186,4,0),\"\")","v":""}]
[null,null,null,null,null,null,null,null,null,null,null,null,null,0,0,0,"LIC Nomura MF Infrastructure Direct",16808,null,null,null,null,null,null,null,null,null,null,null,null,{"$f":"IFERROR(VLOOKUP(ROWS($AE$2:AE439),P439:Q1187,2,0),\"\")","v":""},null,null,null,null,{"$f":"IFERROR(VLOOKUP(ROWS(AJ$2:$AJ439),O439:Q1187,3,0),\"\")","v":""},null,{"$f":"IFERROR(VLOOKUP(ROWS(AL$2:$AL439),N439:Q1187,4,0),\"\")","v":""}]
[null,null,null,null,null,null,null,null,null,null,null,null,null,0,0,0,"LIC Nomura MF Opportunities",2615,null,null,null,null,null,null,null,null,null,null,null,null,{"$f":"IFERROR(VLOOKUP(ROWS($AE$2:AE440),P440:Q1188,2,0),\"\")","v":""},null,null,null,null,{"$f":"IFERROR(VLOOKUP(ROWS(AJ$2:$AJ440),O440:Q1188,3,0),\"\")","v":""},null,{"$f":"IFERROR(VLOOKUP(ROWS(AL$2:$AL440),N440:Q1188,4,0),\"\")","v":""}]
[null,null,null,null,null,null,null,null,null,null,null,null,null,0,0,0,"LIC Nomura MF Opportunities Direct",16867,null,null,null,null,null,null,null,null,null,null,null,null,{"$f":"IFERROR(VLOOKUP(ROWS($AE$2:AE441),P441:Q1189,2,0),\"\")","v":""},null,null,null,null,{"$f":"IFERROR(VLOOKUP(ROWS(AJ$2:$AJ441),O441:Q1189,3,0),\"\")","v":""},null,{"$f":"IFERROR(VLOOKUP(ROWS(AL$2:$AL441),N441:Q1189,4,0),\"\")","v":""}]
[null,null,null,null,null,null,null,null,null,null,null,null,null,0,0,0,"LIC Nomura MF Sensex Advantage",1480,null,null,null,null,null,null,null,null,null,null,null,null,{"$f":"IFERROR(VLOOKUP(ROWS($AE$2:AE442),P442:Q1190,2,0),\"\")","v":""},null,null,null,null,{"$f":"IFERROR(VLOOKUP(ROWS(AJ$2:$AJ442),O442:Q1190,3,0),\"\")","v":""},null,{"$f":"IFERROR(VLOOKUP(ROWS(AL$2:$AL442),N442:Q1190,4,0),\"\")","v":""}]
[null,null,null,null,null,null,null,null,null,null,null,null,null,0,0,0,"LIC Nomura MF Sensex Advantage Direct",16742,null,null,null,null,null,null,null,null,null,null,null,null,{"$f":"IFERROR(VLOOKUP(ROWS($AE$2:AE443),P443:Q1191,2,0),\"\")","v":""},null,null,null,null,{"$f":"IFERROR(VLOOKUP(ROWS(AJ$2:$AJ443),O443:Q1191,3,0),\"\")","v":""},null,{"$f":"IFERROR(VLOOKUP(ROWS(AL$2:$AL443),N443:Q1191,4,0),\"\")","v":""}]
[null,null,null,null,null,null,null,null,null,null,null,null,null,0,0,0,"LIC Nomura MF Systematic Asset Allocation",5733,null,null,null,null,null,null,null,null,null,null,null,null,{"$f":"IFERROR(VLOOKUP(ROWS($AE$2:AE444),P444:Q1192,2,0),\"\")","v":""},null,null,null,null,{"$f":"IFERROR(VLOOKUP(ROWS(AJ$2:$AJ444),O444:Q1192,3,0),\"\")","v":""},null,{"$f":"IFERROR(VLOOKUP(ROWS(AL$2:$AL444),N444:Q1192,4,0),\"\")","v":""}]
[null,null,null,null,null,null,null,null,null,null,null,null,null,0,0,0,"LIC Nomura MF Systematic Asset Allocation Direct",17452,null,null,null,null,null,null,null,null,null,null,null,null,{"$f":"IFERROR(VLOOKUP(ROWS($AE$2:AE445),P445:Q1193,2,0),\"\")","v":""},null,null,null,null,{"$f":"IFERROR(VLOOKUP(ROWS(AJ$2:$AJ445),O445:Q1193,3,0),\"\")","v":""},null,{"$f":"IFERROR(VLOOKUP(ROWS(AL$2:$AL445),N445:Q1193,4,0),\"\")","v":""}]
[null,null,null,null,null,null,null,null,null,null,null,null,null,0,0,0,"LIC Nomura MF Tax Plan",405,null,null,null,null,null,null,null,null,null,null,null,null,{"$f":"IFERROR(VLOOKUP(ROWS($AE$2:AE446),P446:Q1194,2,0),\"\")","v":""},null,null,null,null,{"$f":"IFERROR(VLOOKUP(ROWS(AJ$2:$AJ446),O446:Q1194,3,0),\"\")","v":""},null,{"$f":"IFERROR(VLOOKUP(ROWS(AL$2:$AL446),N446:Q1194,4,0),\"\")","v":""}]
[null,null,null,null,null,null,null,null,null,null,null,null,null,0,0,0,"LIC Nomura MF Tax Plan Direct",16868,null,null,null,null,null,null,null,null,null,null,null,null,{"$f":"IFERROR(VLOOKUP(ROWS($AE$2:AE447),P447:Q1195,2,0),\"\")","v":""},null,null,null,null,{"$f":"IFERROR(VLOOKUP(ROWS(AJ$2:$AJ447),O447:Q1195,3,0),\"\")","v":""},null,{"$f":"IFERROR(VLOOKUP(ROWS(AL$2:$AL447),N447:Q1195,4,0),\"\")","v":""}]
[null,null,null,null,null,null,null,null,null,null,null,null,null,0,0,0,"LIC Nomura MF Top 100",6233,null,null,null,null,null,null,null,null,null,null,null,null,{"$f":"IFERROR(VLOOKUP(ROWS($AE$2:AE448),P448:Q1196,2,0),\"\")","v":""},null,null,null,null,{"$f":"IFERROR(VLOOKUP(ROWS(AJ$2:$AJ448),O448:Q1196,3,0),\"\")","v":""},null,{"$f":"IFERROR(VLOOKUP(ROWS(AL$2:$AL448),N448:Q1196,4,0),\"\")","v":""}]
[null,null,null,null,null,null,null,null,null,null,null,null,null,0,0,0,"LIC Nomura MF Top 100 Direct",16862,null,null,null,null,null,null,null,null,null,null,null,null,{"$f":"IFERROR(VLOOKUP(ROWS($AE$2:AE449),P449:Q1197,2,0),\"\")","v":""},null,null,null,null,{"$f":"IFERROR(VLOOKUP(ROWS(AJ$2:$AJ449),O449:Q1197,3,0),\"\")","v":""},null,{"$f":"IFERROR(VLOOKUP(ROWS(AL$2:$AL449),N449:Q1197,4,0),\"\")","v":""}]
[null,null,null,null,null,null,null,null,null,null,null,null,null,0,0,{"$f":"IF(ISNUMBER(SEARCH($H$6,Q450)),MAX($P$1,P449)+1,0)","v":0},"Mirae Asset China Advantage",10683,null,null,null,null,null,null,null,null,null,null,null,null,{"$f":"IFERROR(VLOOKUP(ROWS($AE$2:AE450),P450:Q1198,2,0),\"\")","v":""},null,null,null,null,{"$f":"IFERROR(VLOOKUP(ROWS(AJ$2:$AJ450),O450:Q1198,3,0),\"\")","v":""},null,{"$f":"IFERROR(VLOOKUP(ROWS(AL$2:$AL450),N450:Q1198,4,0),\"\")","v":""}]
[null,null,null,null,null,null,null,null,null,null,null,null,null,{"$f":"IF(ISNUMBER(SEARCH($H$16,Q451)),MAX($N$1,N450)+1,0)","v":0},{"$f":"IF(ISNUMBER(SEARCH($H$11,Q451)),MAX($O$1,O450)+1,0)","v":0},0,"Mirae Asset China Advantage Direct",16987,null,null,null,null,null,null,null,null,null,null,null,null,{"$f":"IFERROR(VLOOKUP(ROWS($AE$2:AE451),P451:Q1199,2,0),\"\")","v":""},null,null,null,null,{"$f":"IFERROR(VLOOKUP(ROWS(AJ$2:$AJ451),O451:Q1199,3,0),\"\")","v":""},null,{"$f":"IFERROR(VLOOKUP(ROWS(AL$2:$AL451),N451:Q1199,4,0),\"\")","v":""}]
[null,null,null,null,null,null,null,null,null,null,null,null,null,0,0,0,"Mirae Asset Emerging Bluechip Regular",11213,null,null,null,null,null,null,null,null,null,null,null,null,{"$f":"IFERROR(VLOOKUP(ROWS($AE$2:AE452),P452:Q1200,2,0),\"\")","v":""},null,null,null,null,{"$f":"IFERROR(VLOOKUP(ROWS(AJ$2:$AJ452),O452:Q1200,3,0),\"\")","v":""},null,{"$f":"IFERROR(VLOOKUP(ROWS(AL$2:$AL452),N452:Q1200,4,0),\"\")","v":""}]
[null,null,null,null,null,null,null,null,null,null,null,null,null,0,0,0,"Mirae Asset Emerging Bluechip Regular Direct",16563,null,null,null,null,null,null,null,null,null,null,null,null,{"$f":"IFERROR(VLOOKUP(ROWS($AE$2:AE453),P453:Q1201,2,0),\"\")","v":""},null,null,null,null,{"$f":"IFERROR(VLOOKUP(ROWS(AJ$2:$AJ453),O453:Q1201,3,0),\"\")","v":""},null,{"$f":"IFERROR(VLOOKUP(ROWS(AL$2:$AL453),N453:Q1201,4,0),\"\")","v":""}]
[null,null,null,null,null,null,null,null,null,null,null,null,null,0,0,0,"Mirae Asset Global Commodity Stocks",8186,null,null,null,null,null,null,null,null,null,null,null,null,{"$f":"IFERROR(VLOOKUP(ROWS($AE$2:AE454),P454:Q1202,2,0),\"\")","v":""},null,null,null,null,{"$f":"IFERROR(VLOOKUP(ROWS(AJ$2:$AJ454),O454:Q1202,3,0),\"\")","v":""},null,{"$f":"IFERROR(VLOOKUP(ROWS(AL$2:$AL454),N454:Q1202,4,0),\"\")","v":""}]
[null,null,null,null,null,null,null,null,null,null,null,null,null,0,0,0,"Mirae Asset Global Commodity Stocks Direct",16568,null,null,null,null,null,null,null,null,null,null,null,null,{"$f":"IFERROR(VLOOKUP(ROWS($AE$2:AE455),P455:Q1203,2,0),\"\")","v":""},null,null,null,null,{"$f":"IFERROR(VLOOKUP(ROWS(AJ$2:$AJ455),O455:Q1203,3,0),\"\")","v":""},null,{"$f":"IFERROR(VLOOKUP(ROWS(AL$2:$AL455),N455:Q1203,4,0),\"\")","v":""}]
[null,null,null,null,null,null,null,null,null,null,null,null,null,0,0,0,"Mirae Asset India Opportunities Regular",6762,null,null,null,null,null,null,null,null,null,null,null,null,{"$f":"IFERROR(VLOOKUP(ROWS($AE$2:AE456),P456:Q1204,2,0),\"\")","v":""},null,null,null,null,{"$f":"IFERROR(VLOOKUP(ROWS(AJ$2:$AJ456),O456:Q1204,3,0),\"\")","v":""},null,{"$f":"IFERROR(VLOOKUP(ROWS(AL$2:$AL456),N456:Q1204,4,0),\"\")","v":""}]
[null,null,null,null,null,null,null,null,null,null,null,null,null,0,0,0,"Mirae Asset India Opportunities Regular Direct",16575,null,null,null,null,null,null,null,null,null,null,null,null,{"$f":"IFERROR(VLOOKUP(ROWS($AE$2:AE457),P457:Q1205,2,0),\"\")","v":""},null,null,null,null,{"$f":"IFERROR(VLOOKUP(ROWS(AJ$2:$AJ457),O457:Q1205,3,0),\"\")","v":""},null,{"$f":"IFERROR(VLOOKUP(ROWS(AL$2:$AL457),N457:Q1205,4,0),\"\")","v":""}]
[null,null,null,null,null,null,null,null,null,null,null,null,null,0,0,0,"Mirae Asset India-China Consumption Reg",12342,null,null,null,null,null,null,null,null,null,null,null,null,{"$f":"IFERROR(VLOOKUP(ROWS($AE$2:AE458),P458:Q1206,2,0),\"\")","v":""},null,null,null,null,{"$f":"IFERROR(VLOOKUP(ROWS(AJ$2:$AJ458),O458:Q1206,3,0),\"\")","v":""},null,{"$f":"IFERROR(VLOOKUP(ROWS(AL$2:$AL458),N458:Q1206,4,0),\"\")","v":""}]
[null,null,null,null,null,null,null,null,null,null,null,null,null,0,0,0,"Mirae Asset India-China Consumption Reg Direct",16584,null,null,null,null,null,null,null,null,null,null,null,null,{"$f":"IFERROR(VLOOKUP(ROWS($AE$2:AE459),P459:Q1207,2,0),\"\")","v":""},null,null,null,null,{"$f":"IFERROR(VLOOKUP(ROWS(AJ$2:$AJ459),O459:Q1207,3,0),\"\")","v":""},null,{"$f":"IFERROR(VLOOKUP(ROWS(AL$2:$AL459),N459:Q1207,4,0),\"\")","v":""}]
[null,null,null,null,null,null,null,null,null,null,null,null,null,0,0,0,"Morgan Stanley A.C.E. Direct",16617,null,null,null,null,null,null,null,null,null,null,null,null,{"$f":"IFERROR(VLOOKUP(ROWS($AE$2:AE460),P460:Q1208,2,0),\"\")","v":""},null,null,null,null,{"$f":"IFERROR(VLOOKUP(ROWS(AJ$2:$AJ460),O460:Q1208,3,0),\"\")","v":""},null,{"$f":"IFERROR(VLOOKUP(ROWS(AL$2:$AL460),N460:Q1208,4,0),\"\")","v":""}]
[null,null,null,null,null,null,null,null,null,null,null,null,null,0,0,0,"Morgan Stanley A.C.E. Reg",6770,null,null,null,null,null,null,null,null,null,null,null,null,{"$f":"IFERROR(VLOOKUP(ROWS($AE$2:AE461),P461:Q1209,2,0),\"\")","v":""},null,null,null,null,{"$f":"IFERROR(VLOOKUP(ROWS(AJ$2:$AJ461),O461:Q1209,3,0),\"\")","v":""},null,{"$f":"IFERROR(VLOOKUP(ROWS(AL$2:$AL461),N461:Q1209,4,0),\"\")","v":""}]
[null,null,null,null,null,null,null,null,null,null,null,null,null,0,0,0,"Morgan Stanley Growth Direct",16626,null,null,null,null,null,null,null,null,null,null,null,null,{"$f":"IFERROR(VLOOKUP(ROWS($AE$2:AE462),P462:Q1210,2,0),\"\")","v":""},null,null,null,null,{"$f":"IFERROR(VLOOKUP(ROWS(AJ$2:$AJ462),O462:Q1210,3,0),\"\")","v":""},null,{"$f":"IFERROR(VLOOKUP(ROWS(AL$2:$AL462),N462:Q1210,4,0),\"\")","v":""}]
[null,null,null,null,null,null,null,null,null,null,null,null,null,0,0,0,"Morgan Stanley Growth Reg",172,null,null,null,null,null,null,null,null,null,null,null,null,{"$f":"IFERROR(VLOOKUP(ROWS($AE$2:AE463),P463:Q1211,2,0),\"\")","v":""},null,null,null,null,{"$f":"IFERROR(VLOOKUP(ROWS(AJ$2:$AJ463),O463:Q1211,3,0),\"\")","v":""},null,{"$f":"IFERROR(VLOOKUP(ROWS(AL$2:$AL463),N463:Q1211,4,0),\"\")","v":""}]
[null,null,null,null,null,null,null,null,null,null,null,null,null,0,0,0,"Motilal Oswal MOSt Focused 25 Direct",19514,null,null,null,null,null,null,null,null,null,null,null,null,{"$f":"IFERROR(VLOOKUP(ROWS($AE$2:AE464),P464:Q1212,2,0),\"\")","v":""},null,null,null,null,{"$f":"IFERROR(VLOOKUP(ROWS(AJ$2:$AJ464),O464:Q1212,3,0),\"\")","v":""},null,{"$f":"IFERROR(VLOOKUP(ROWS(AL$2:$AL464),N464:Q1212,4,0),\"\")","v":""}]
[null,null,null,null,null,null,null,null,null,null,null,null,null,0,0,0,"Motilal Oswal MOSt Focused 25 Reg",19512,null,null,null,null,null,null,null,null,null,null,null,null,{"$f":"IFERROR(VLOOKUP(ROWS($AE$2:AE465),P465:Q1213,2,0),\"\")","v":""},null,null,null,null,{"$f":"IFERROR(VLOOKUP(ROWS(AJ$2:$AJ465),O465:Q1213,3,0),\"\")","v":""},null,{"$f":"IFERROR(VLOOKUP(ROWS(AL$2:$AL465),N465:Q1213,4,0),\"\")","v":""}]
[null,null,null,null,null,null,null,null,null,null,null,null,null,0,0,0,"Motilal Oswal MOSt Shares M100 ETF",12012,null,null,null,null,null,null,null,null,null,null,null,null,{"$f":"IFERROR(VLOOKUP(ROWS($AE$2:AE466),P466:Q1214,2,0),\"\")","v":""},null,null,null,null,{"$f":"IFERROR(VLOOKUP(ROWS(AJ$2:$AJ466),O466:Q1214,3,0),\"\")","v":""},null,{"$f":"IFERROR(VLOOKUP(ROWS(AL$2:$AL466),N466:Q1214,4,0),\"\")","v":""}]
[null,null,null,null,null,null,null,null,null,null,null,null,null,0,0,0,"Motilal Oswal MOSt Shares M50 ETF",11348,null,null,null,null,null,null,null,null,null,null,null,null,{"$f":"IFERROR(VLOOKUP(ROWS($AE$2:AE467),P467:Q1215,2,0),\"\")","v":""},null,null,null,null,{"$f":"IFERROR(VLOOKUP(ROWS(AJ$2:$AJ467),O467:Q1215,3,0),\"\")","v":""},null,{"$f":"IFERROR(VLOOKUP(ROWS(AL$2:$AL467),N467:Q1215,4,0),\"\")","v":""}]
[null,null,null,null,null,null,null,null,null,null,null,null,null,0,0,0,"Motilal Oswal MOSt Shares NASDAQ-100 ETF",12498,null,null,null,null,null,null,null,null,null,null,null,null,{"$f":"IFERROR(VLOOKUP(ROWS($AE$2:AE468),P468:Q1216,2,0),\"\")","v":""},null,null,null,null,{"$f":"IFERROR(VLOOKUP(ROWS(AJ$2:$AJ468),O468:Q1216,3,0),\"\")","v":""},null,{"$f":"IFERROR(VLOOKUP(ROWS(AL$2:$AL468),N468:Q1216,4,0),\"\")","v":""}]
[null,null,null,null,null,null,null,null,null,null,null,null,null,0,0,0,"Peerless Equity",13264,null,null,null,null,null,null,null,null,null,null,null,null,{"$f":"IFERROR(VLOOKUP(ROWS($AE$2:AE469),P469:Q1217,2,0),\"\")","v":""},null,null,null,null,{"$f":"IFERROR(VLOOKUP(ROWS(AJ$2:$AJ469),O469:Q1217,3,0),\"\")","v":""},null,{"$f":"IFERROR(VLOOKUP(ROWS(AL$2:$AL469),N469:Q1217,4,0),\"\")","v":""}]
[null,null,null,null,null,null,null,null,null,null,null,null,null,0,0,0,"Peerless Equity Direct",16461,null,null,null,null,null,null,null,null,null,null,null,null,{"$f":"IFERROR(VLOOKUP(ROWS($AE$2:AE470),P470:Q1218,2,0),\"\")","v":""},null,null,null,null,{"$f":"IFERROR(VLOOKUP(ROWS(AJ$2:$AJ470),O470:Q1218,3,0),\"\")","v":""},null,{"$f":"IFERROR(VLOOKUP(ROWS(AL$2:$AL470),N470:Q1218,4,0),\"\")","v":""}]
[null,null,null,null,null,null,null,null,null,null,null,null,null,0,0,0,"PineBridge India Equity Standard",5010,null,null,null,null,null,null,null,null,null,null,null,null,{"$f":"IFERROR(VLOOKUP(ROWS($AE$2:AE471),P471:Q1219,2,0),\"\")","v":""},null,null,null,null,{"$f":"IFERROR(VLOOKUP(ROWS(AJ$2:$AJ471),O471:Q1219,3,0),\"\")","v":""},null,{"$f":"IFERROR(VLOOKUP(ROWS(AL$2:$AL471),N471:Q1219,4,0),\"\")","v":""}]
[null,null,null,null,null,null,null,null,null,null,null,null,null,0,0,0,"PineBridge India Equity Standard Direct",16494,null,null,null,null,null,null,null,null,null,null,null,null,{"$f":"IFERROR(VLOOKUP(ROWS($AE$2:AE472),P472:Q1220,2,0),\"\")","v":""},null,null,null,null,{"$f":"IFERROR(VLOOKUP(ROWS(AJ$2:$AJ472),O472:Q1220,3,0),\"\")","v":""},null,{"$f":"IFERROR(VLOOKUP(ROWS(AL$2:$AL472),N472:Q1220,4,0),\"\")","v":""}]
[null,null,null,null,null,null,null,null,null,null,null,null,null,0,0,0,"PineBridge Infrastructure and Economic Reform Inst#",6671,null,null,null,null,null,null,null,null,null,null,null,null,{"$f":"IFERROR(VLOOKUP(ROWS($AE$2:AE473),P473:Q1221,2,0),\"\")","v":""},null,null,null,null,{"$f":"IFERROR(VLOOKUP(ROWS(AJ$2:$AJ473),O473:Q1221,3,0),\"\")","v":""},null,{"$f":"IFERROR(VLOOKUP(ROWS(AL$2:$AL473),N473:Q1221,4,0),\"\")","v":""}]
[null,null,null,null,null,null,null,null,null,null,null,null,null,0,0,0,"PineBridge Infrastructure and Economic Reform Standard",6669,null,null,null,null,null,null,null,null,null,null,null,null,{"$f":"IFERROR(VLOOKUP(ROWS($AE$2:AE474),P474:Q1222,2,0),\"\")","v":""},null,null,null,null,{"$f":"IFERROR(VLOOKUP(ROWS(AJ$2:$AJ474),O474:Q1222,3,0),\"\")","v":""},null,{"$f":"IFERROR(VLOOKUP(ROWS(AL$2:$AL474),N474:Q1222,4,0),\"\")","v":""}]
[null,null,null,null,null,null,null,null,null,null,null,null,null,0,0,0,"PineBridge Infrastructure and Economic Reform Standard Direct",16508,null,null,null,null,null,null,null,null,null,null,null,null,{"$f":"IFERROR(VLOOKUP(ROWS($AE$2:AE475),P475:Q1223,2,0),\"\")","v":""},null,null,null,null,{"$f":"IFERROR(VLOOKUP(ROWS(AJ$2:$AJ475),O475:Q1223,3,0),\"\")","v":""},null,{"$f":"IFERROR(VLOOKUP(ROWS(AL$2:$AL475),N475:Q1223,4,0),\"\")","v":""}]
[null,null,null,null,null,null,null,null,null,null,null,null,null,0,0,0,"PineBridge World Gold Standard",7515,null,null,null,null,null,null,null,null,null,null,null,null,{"$f":"IFERROR(VLOOKUP(ROWS($AE$2:AE476),P476:Q1224,2,0),\"\")","v":""},null,null,null,null,{"$f":"IFERROR(VLOOKUP(ROWS(AJ$2:$AJ476),O476:Q1224,3,0),\"\")","v":""},null,{"$f":"IFERROR(VLOOKUP(ROWS(AL$2:$AL476),N476:Q1224,4,0),\"\")","v":""}]
[null,null,null,null,null,null,null,null,null,null,null,null,null,0,0,0,"PineBridge World Gold Standard Direct",16995,null,null,null,null,null,null,null,null,null,null,null,null,{"$f":"IFERROR(VLOOKUP(ROWS($AE$2:AE477),P477:Q1225,2,0),\"\")","v":""},null,null,null,null,{"$f":"IFERROR(VLOOKUP(ROWS(AJ$2:$AJ477),O477:Q1225,3,0),\"\")","v":""},null,{"$f":"IFERROR(VLOOKUP(ROWS(AL$2:$AL477),N477:Q1225,4,0),\"\")","v":""}]
[null,null,null,null,null,null,null,null,null,null,null,null,null,0,0,0,"PPFAS Long Term Value Direct",19701,null,null,null,null,null,null,null,null,null,null,null,null,{"$f":"IFERROR(VLOOKUP(ROWS($AE$2:AE478),P478:Q1226,2,0),\"\")","v":""},null,null,null,null,{"$f":"IFERROR(VLOOKUP(ROWS(AJ$2:$AJ478),O478:Q1226,3,0),\"\")","v":""},null,{"$f":"IFERROR(VLOOKUP(ROWS(AL$2:$AL478),N478:Q1226,4,0),\"\")","v":""}]
[null,null,null,null,null,null,null,null,null,null,null,null,null,0,0,0,"PPFAS Long Term Value Regular",19699,null,null,null,null,null,null,null,null,null,null,null,null,{"$f":"IFERROR(VLOOKUP(ROWS($AE$2:AE479),P479:Q1227,2,0),\"\")","v":""},null,null,null,null,{"$f":"IFERROR(VLOOKUP(ROWS(AJ$2:$AJ479),O479:Q1227,3,0),\"\")","v":""},null,{"$f":"IFERROR(VLOOKUP(ROWS(AL$2:$AL479),N479:Q1227,4,0),\"\")","v":""}]
[null,null,null,null,null,null,null,null,null,null,null,null,null,0,0,0,"Pramerica Large Cap Equity",11797,null,null,null,null,null,null,null,null,null,null,null,null,{"$f":"IFERROR(VLOOKUP(ROWS($AE$2:AE480),P480:Q1228,2,0),\"\")","v":""},null,null,null,null,{"$f":"IFERROR(VLOOKUP(ROWS(AJ$2:$AJ480),O480:Q1228,3,0),\"\")","v":""},null,{"$f":"IFERROR(VLOOKUP(ROWS(AL$2:$AL480),N480:Q1228,4,0),\"\")","v":""}]
[null,null,null,null,null,null,null,null,null,null,null,null,null,0,0,0,"Pramerica Large Cap Equity Direct",16639,null,null,null,null,null,null,null,null,null,null,null,null,{"$f":"IFERROR(VLOOKUP(ROWS($AE$2:AE481),P481:Q1229,2,0),\"\")","v":""},null,null,null,null,{"$f":"IFERROR(VLOOKUP(ROWS(AJ$2:$AJ481),O481:Q1229,3,0),\"\")","v":""},null,{"$f":"IFERROR(VLOOKUP(ROWS(AL$2:$AL481),N481:Q1229,4,0),\"\")","v":""}]
[null,null,null,null,null,null,null,null,null,null,null,null,null,0,0,0,"Principal Dividend Yield",2470,null,null,null,null,null,null,null,null,null,null,null,null,{"$f":"IFERROR(VLOOKUP(ROWS($AE$2:AE482),P482:Q1230,2,0),\"\")","v":""},null,null,null,null,{"$f":"IFERROR(VLOOKUP(ROWS(AJ$2:$AJ482),O482:Q1230,3,0),\"\")","v":""},null,{"$f":"IFERROR(VLOOKUP(ROWS(AL$2:$AL482),N482:Q1230,4,0),\"\")","v":""}]
[null,null,null,null,null,null,null,null,null,null,null,null,null,0,0,0,"Principal Dividend Yield Direct",16567,null,null,null,null,null,null,null,null,null,null,null,null,{"$f":"IFERROR(VLOOKUP(ROWS($AE$2:AE483),P483:Q1231,2,0),\"\")","v":""},null,null,null,null,{"$f":"IFERROR(VLOOKUP(ROWS(AJ$2:$AJ483),O483:Q1231,3,0),\"\")","v":""},null,{"$f":"IFERROR(VLOOKUP(ROWS(AL$2:$AL483),N483:Q1231,4,0),\"\")","v":""}]
[null,null,null,null,null,null,null,null,null,null,null,null,null,0,0,0,"Principal Emerging Bluechip",9429,null,null,null,null,null,null,null,null,null,null,null,null,{"$f":"IFERROR(VLOOKUP(ROWS($AE$2:AE484),P484:Q1232,2,0),\"\")","v":""},null,null,null,null,{"$f":"IFERROR(VLOOKUP(ROWS(AJ$2:$AJ484),O484:Q1232,3,0),\"\")","v":""},null,{"$f":"IFERROR(VLOOKUP(ROWS(AL$2:$AL484),N484:Q1232,4,0),\"\")","v":""}]
[null,null,null,null,null,null,null,null,null,null,null,null,null,0,0,0,"Principal Emerging Bluechip Direct",16573,null,null,null,null,null,null,null,null,null,null,null,null,{"$f":"IFERROR(VLOOKUP(ROWS($AE$2:AE485),P485:Q1233,2,0),\"\")","v":""},null,null,null,null,{"$f":"IFERROR(VLOOKUP(ROWS(AJ$2:$AJ485),O485:Q1233,3,0),\"\")","v":""},null,{"$f":"IFERROR(VLOOKUP(ROWS(AL$2:$AL485),N485:Q1233,4,0),\"\")","v":""}]
[null,null,null,null,null,null,null,null,null,null,null,null,null,0,0,0,"Principal Global Opportunities",2117,null,null,null,null,null,null,null,null,null,null,null,null,{"$f":"IFERROR(VLOOKUP(ROWS($AE$2:AE486),P486:Q1234,2,0),\"\")","v":""},null,null,null,null,{"$f":"IFERROR(VLOOKUP(ROWS(AJ$2:$AJ486),O486:Q1234,3,0),\"\")","v":""},null,{"$f":"IFERROR(VLOOKUP(ROWS(AL$2:$AL486),N486:Q1234,4,0),\"\")","v":""}]
[null,null,null,null,null,null,null,null,null,null,null,null,null,0,0,0,"Principal Global Opportunities Direct",16999,null,null,null,null,null,null,null,null,null,null,null,null,{"$f":"IFERROR(VLOOKUP(ROWS($AE$2:AE487),P487:Q1235,2,0),\"\")","v":""},null,null,null,null,{"$f":"IFERROR(VLOOKUP(ROWS(AJ$2:$AJ487),O487:Q1235,3,0),\"\")","v":""},null,{"$f":"IFERROR(VLOOKUP(ROWS(AL$2:$AL487),N487:Q1235,4,0),\"\")","v":""}]
[null,null,null,null,null,null,null,null,null,null,null,null,null,0,0,0,"Principal Growth",866,null,null,null,null,null,null,null,null,null,null,null,null,{"$f":"IFERROR(VLOOKUP(ROWS($AE$2:AE488),P488:Q1236,2,0),\"\")","v":""},null,null,null,null,{"$f":"IFERROR(VLOOKUP(ROWS(AJ$2:$AJ488),O488:Q1236,3,0),\"\")","v":""},null,{"$f":"IFERROR(VLOOKUP(ROWS(AL$2:$AL488),N488:Q1236,4,0),\"\")","v":""}]
[null,null,null,null,null,null,null,null,null,null,null,null,null,0,0,0,"Principal Growth Direct",16580,null,null,null,null,null,null,null,null,null,null,null,null,{"$f":"IFERROR(VLOOKUP(ROWS($AE$2:AE489),P489:Q1237,2,0),\"\")","v":""},null,null,null,null,{"$f":"IFERROR(VLOOKUP(ROWS(AJ$2:$AJ489),O489:Q1237,3,0),\"\")","v":""},null,{"$f":"IFERROR(VLOOKUP(ROWS(AL$2:$AL489),N489:Q1237,4,0),\"\")","v":""}]
[null,null,null,null,null,null,null,null,null,null,null,null,null,0,0,0,"Principal Index",637,null,null,null,null,null,null,null,null,null,null,null,null,{"$f":"IFERROR(VLOOKUP(ROWS($AE$2:AE490),P490:Q1238,2,0),\"\")","v":""},null,null,null,null,{"$f":"IFERROR(VLOOKUP(ROWS(AJ$2:$AJ490),O490:Q1238,3,0),\"\")","v":""},null,{"$f":"IFERROR(VLOOKUP(ROWS(AL$2:$AL490),N490:Q1238,4,0),\"\")","v":""}]
[null,null,null,null,null,null,null,null,null,null,null,null,null,0,0,0,"Principal Index Direct",16608,null,null,null,null,null,null,null,null,null,null,null,null,{"$f":"IFERROR(VLOOKUP(ROWS($AE$2:AE491),P491:Q1239,2,0),\"\")","v":""},null,null,null,null,{"$f":"IFERROR(VLOOKUP(ROWS(AJ$2:$AJ491),O491:Q1239,3,0),\"\")","v":""},null,{"$f":"IFERROR(VLOOKUP(ROWS(AL$2:$AL491),N491:Q1239,4,0),\"\")","v":""}]
[null,null,null,null,null,null,null,null,null,null,null,null,null,0,0,0,"Principal Large Cap",2916,null,null,null,null,null,null,null,null,null,null,null,null,{"$f":"IFERROR(VLOOKUP(ROWS($AE$2:AE492),P492:Q1240,2,0),\"\")","v":""},null,null,null,null,{"$f":"IFERROR(VLOOKUP(ROWS(AJ$2:$AJ492),O492:Q1240,3,0),\"\")","v":""},null,{"$f":"IFERROR(VLOOKUP(ROWS(AL$2:$AL492),N492:Q1240,4,0),\"\")","v":""}]
[null,null,null,null,null,null,null,null,null,null,null,null,null,0,0,0,"Principal Large Cap Direct",16614,null,null,null,null,null,null,null,null,null,null,null,null,{"$f":"IFERROR(VLOOKUP(ROWS($AE$2:AE493),P493:Q1241,2,0),\"\")","v":""},null,null,null,null,{"$f":"IFERROR(VLOOKUP(ROWS(AJ$2:$AJ493),O493:Q1241,3,0),\"\")","v":""},null,{"$f":"IFERROR(VLOOKUP(ROWS(AL$2:$AL493),N493:Q1241,4,0),\"\")","v":""}]
[null,null,null,null,null,null,null,null,null,null,null,null,null,0,0,0,"Principal Personal Tax Saver",105,null,null,null,null,null,null,null,null,null,null,null,null,{"$f":"IFERROR(VLOOKUP(ROWS($AE$2:AE494),P494:Q1242,2,0),\"\")","v":""},null,null,null,null,{"$f":"IFERROR(VLOOKUP(ROWS(AJ$2:$AJ494),O494:Q1242,3,0),\"\")","v":""},null,{"$f":"IFERROR(VLOOKUP(ROWS(AL$2:$AL494),N494:Q1242,4,0),\"\")","v":""}]
[null,null,null,null,null,null,null,null,null,null,null,null,null,0,0,0,"Principal Personal Tax Saver Direct",16621,null,null,null,null,null,null,null,null,null,null,null,null,{"$f":"IFERROR(VLOOKUP(ROWS($AE$2:AE495),P495:Q1243,2,0),\"\")","v":""},null,null,null,null,{"$f":"IFERROR(VLOOKUP(ROWS(AJ$2:$AJ495),O495:Q1243,3,0),\"\")","v":""},null,{"$f":"IFERROR(VLOOKUP(ROWS(AL$2:$AL495),N495:Q1243,4,0),\"\")","v":""}]
[null,null,null,null,null,null,null,null,null,null,null,null,null,0,0,0,"Principal Tax Savings",89,null,null,null,null,null,null,null,null,null,null,null,null,{"$f":"IFERROR(VLOOKUP(ROWS($AE$2:AE496),P496:Q1244,2,0),\"\")","v":""},null,null,null,null,{"$f":"IFERROR(VLOOKUP(ROWS(AJ$2:$AJ496),O496:Q1244,3,0),\"\")","v":""},null,{"$f":"IFERROR(VLOOKUP(ROWS(AL$2:$AL496),N496:Q1244,4,0),\"\")","v":""}]
[null,null,null,null,null,null,null,null,null,null,null,null,null,0,0,0,"Principal Tax Savings Direct",16650,null,null,null,null,null,null,null,null,null,null,null,null,{"$f":"IFERROR(VLOOKUP(ROWS($AE$2:AE497),P497:Q1245,2,0),\"\")","v":""},null,null,null,null,{"$f":"IFERROR(VLOOKUP(ROWS(AJ$2:$AJ497),O497:Q1245,3,0),\"\")","v":""},null,{"$f":"IFERROR(VLOOKUP(ROWS(AL$2:$AL497),N497:Q1245,4,0),\"\")","v":""}]
[null,null,null,null,null,null,null,null,null,null,null,null,null,0,0,0,"Quantum Equity FoF",10550,null,null,null,null,null,null,null,null,null,null,null,null,{"$f":"IFERROR(VLOOKUP(ROWS($AE$2:AE498),P498:Q1246,2,0),\"\")","v":""},null,null,null,null,{"$f":"IFERROR(VLOOKUP(ROWS(AJ$2:$AJ498),O498:Q1246,3,0),\"\")","v":""},null,{"$f":"IFERROR(VLOOKUP(ROWS(AL$2:$AL498),N498:Q1246,4,0),\"\")","v":""}]
[null,null,null,null,null,null,null,null,null,null,null,null,null,0,0,0,"Quantum Index",7834,null,null,null,null,null,null,null,null,null,null,null,null,{"$f":"IFERROR(VLOOKUP(ROWS($AE$2:AE499),P499:Q1247,2,0),\"\")","v":""},null,null,null,null,{"$f":"IFERROR(VLOOKUP(ROWS(AJ$2:$AJ499),O499:Q1247,3,0),\"\")","v":""},null,{"$f":"IFERROR(VLOOKUP(ROWS(AL$2:$AL499),N499:Q1247,4,0),\"\")","v":""}]
[null,null,null,null,null,null,null,null,null,null,null,null,null,1,0,0,"Quantum Long Term Equity",3181,null,null,null,null,null,null,null,null,null,null,null,null,{"$f":"IFERROR(VLOOKUP(ROWS($AE$2:AE500),P500:Q1248,2,0),\"\")","v":""},null,null,null,null,{"$f":"IFERROR(VLOOKUP(ROWS(AJ$2:$AJ500),O500:Q1248,3,0),\"\")","v":""},null,{"$f":"IFERROR(VLOOKUP(ROWS(AL$2:$AL500),N500:Q1248,4,0),\"\")","v":""}]
[null,null,null,null,null,null,null,null,null,null,null,null,null,0,0,0,"Quantum Tax Saving",10080,null,null,null,null,null,null,null,null,null,null,null,null,{"$f":"IFERROR(VLOOKUP(ROWS($AE$2:AE501),P501:Q1249,2,0),\"\")","v":""},null,null,null,null,{"$f":"IFERROR(VLOOKUP(ROWS(AJ$2:$AJ501),O501:Q1249,3,0),\"\")","v":""},null,{"$f":"IFERROR(VLOOKUP(ROWS(AL$2:$AL501),N501:Q1249,4,0),\"\")","v":""}]
[null,null,null,null,null,null,null,null,null,null,null,null,null,0,0,0,"R*Shares Banking ETF",7803,null,null,null,null,null,null,null,null,null,null,null,null,{"$f":"IFERROR(VLOOKUP(ROWS($AE$2:AE502),P502:Q1250,2,0),\"\")","v":""},null,null,null,null,{"$f":"IFERROR(VLOOKUP(ROWS(AJ$2:$AJ502),O502:Q1250,3,0),\"\")","v":""},null,{"$f":"IFERROR(VLOOKUP(ROWS(AL$2:$AL502),N502:Q1250,4,0),\"\")","v":""}]
[null,null,null,null,null,null,null,null,null,null,null,null,null,0,0,0,"R*Shares CNX 100",18234,null,null,null,null,null,null,null,null,null,null,null,null,{"$f":"IFERROR(VLOOKUP(ROWS($AE$2:AE503),P503:Q1251,2,0),\"\")","v":""},null,null,null,null,{"$f":"IFERROR(VLOOKUP(ROWS(AJ$2:$AJ503),O503:Q1251,3,0),\"\")","v":""},null,{"$f":"IFERROR(VLOOKUP(ROWS(AL$2:$AL503),N503:Q1251,4,0),\"\")","v":""}]
[null,null,null,null,null,null,null,null,null,null,null,null,null,0,0,0,"Reliance Banking",1708,null,null,null,null,null,null,null,null,null,null,null,null,{"$f":"IFERROR(VLOOKUP(ROWS($AE$2:AE504),P504:Q1252,2,0),\"\")","v":""},null,null,null,null,{"$f":"IFERROR(VLOOKUP(ROWS(AJ$2:$AJ504),O504:Q1252,3,0),\"\")","v":""},null,{"$f":"IFERROR(VLOOKUP(ROWS(AL$2:$AL504),N504:Q1252,4,0),\"\")","v":""}]
[null,null,null,null,null,null,null,null,null,null,null,null,null,0,0,0,"Reliance Banking Direct",16048,null,null,null,null,null,null,null,null,null,null,null,null,{"$f":"IFERROR(VLOOKUP(ROWS($AE$2:AE505),P505:Q1253,2,0),\"\")","v":""},null,null,null,null,{"$f":"IFERROR(VLOOKUP(ROWS(AJ$2:$AJ505),O505:Q1253,3,0),\"\")","v":""},null,{"$f":"IFERROR(VLOOKUP(ROWS(AL$2:$AL505),N505:Q1253,4,0),\"\")","v":""}]
[null,null,null,null,null,null,null,null,null,null,null,null,null,0,0,0,"Reliance Diversified Power Sector",2194,null,null,null,null,null,null,null,null,null,null,null,null,{"$f":"IFERROR(VLOOKUP(ROWS($AE$2:AE506),P506:Q1254,2,0),\"\")","v":""},null,null,null,null,{"$f":"IFERROR(VLOOKUP(ROWS(AJ$2:$AJ506),O506:Q1254,3,0),\"\")","v":""},null,{"$f":"IFERROR(VLOOKUP(ROWS(AL$2:$AL506),N506:Q1254,4,0),\"\")","v":""}]
[null,null,null,null,null,null,null,null,null,null,null,null,null,0,0,0,"Reliance Diversified Power Sector Direct",16054,null,null,null,null,null,null,null,null,null,null,null,null,{"$f":"IFERROR(VLOOKUP(ROWS($AE$2:AE507),P507:Q1255,2,0),\"\")","v":""},null,null,null,null,{"$f":"IFERROR(VLOOKUP(ROWS(AJ$2:$AJ507),O507:Q1255,3,0),\"\")","v":""},null,{"$f":"IFERROR(VLOOKUP(ROWS(AL$2:$AL507),N507:Q1255,4,0),\"\")","v":""}]
[null,null,null,null,null,null,null,null,null,null,null,null,null,0,0,0,"Reliance Equity",3158,null,null,null,null,null,null,null,null,null,null,null,null,{"$f":"IFERROR(VLOOKUP(ROWS($AE$2:AE508),P508:Q1256,2,0),\"\")","v":""},null,null,null,null,{"$f":"IFERROR(VLOOKUP(ROWS(AJ$2:$AJ508),O508:Q1256,3,0),\"\")","v":""},null,{"$f":"IFERROR(VLOOKUP(ROWS(AL$2:$AL508),N508:Q1256,4,0),\"\")","v":""}]
[null,null,null,null,null,null,null,null,null,null,null,null,null,0,0,0,"Reliance Equity Direct",17038,null,null,null,null,null,null,null,null,null,null,null,null,{"$f":"IFERROR(VLOOKUP(ROWS($AE$2:AE509),P509:Q1257,2,0),\"\")","v":""},null,null,null,null,{"$f":"IFERROR(VLOOKUP(ROWS(AJ$2:$AJ509),O509:Q1257,3,0),\"\")","v":""},null,{"$f":"IFERROR(VLOOKUP(ROWS(AL$2:$AL509),N509:Q1257,4,0),\"\")","v":""}]
[null,null,null,null,null,null,null,null,null,null,null,null,null,0,0,0,"Reliance Equity Opportunities",2640,null,null,null,null,null,null,null,null,null,null,null,null,{"$f":"IFERROR(VLOOKUP(ROWS($AE$2:AE510),P510:Q1258,2,0),\"\")","v":""},null,null,null,null,{"$f":"IFERROR(VLOOKUP(ROWS(AJ$2:$AJ510),O510:Q1258,3,0),\"\")","v":""},null,{"$f":"IFERROR(VLOOKUP(ROWS(AL$2:$AL510),N510:Q1258,4,0),\"\")","v":""}]
[null,null,null,null,null,null,null,null,null,null,null,null,null,0,0,0,"Reliance Equity Opportunities Direct",16068,null,null,null,null,null,null,null,null,null,null,null,null,{"$f":"IFERROR(VLOOKUP(ROWS($AE$2:AE511),P511:Q1259,2,0),\"\")","v":""},null,null,null,null,{"$f":"IFERROR(VLOOKUP(ROWS(AJ$2:$AJ511),O511:Q1259,3,0),\"\")","v":""},null,{"$f":"IFERROR(VLOOKUP(ROWS(AL$2:$AL511),N511:Q1259,4,0),\"\")","v":""}]
[null,null,null,null,null,null,null,null,null,null,null,null,null,0,0,0,"Reliance Equity Opportunities Inst#",5589,null,null,null,null,null,null,null,null,null,null,null,null,{"$f":"IFERROR(VLOOKUP(ROWS($AE$2:AE512),P512:Q1260,2,0),\"\")","v":""},null,null,null,null,{"$f":"IFERROR(VLOOKUP(ROWS(AJ$2:$AJ512),O512:Q1260,3,0),\"\")","v":""},null,{"$f":"IFERROR(VLOOKUP(ROWS(AL$2:$AL512),N512:Q1260,4,0),\"\")","v":""}]
[null,null,null,null,null,null,null,null,null,null,null,null,null,0,0,0,"Reliance Growth",183,null,null,null,null,null,null,null,null,null,null,null,null,{"$f":"IFERROR(VLOOKUP(ROWS($AE$2:AE513),P513:Q1261,2,0),\"\")","v":""},null,null,null,null,{"$f":"IFERROR(VLOOKUP(ROWS(AJ$2:$AJ513),O513:Q1261,3,0),\"\")","v":""},null,{"$f":"IFERROR(VLOOKUP(ROWS(AL$2:$AL513),N513:Q1261,4,0),\"\")","v":""}]
[null,null,null,null,null,null,null,null,null,null,null,null,null,0,0,{"$f":"IF(ISNUMBER(SEARCH($H$6,Q514)),MAX($P$1,P513)+1,0)","v":0},"Reliance Growth Direct",16083,null,null,null,null,null,null,null,null,null,null,null,null,{"$f":"IFERROR(VLOOKUP(ROWS($AE$2:AE514),P514:Q1262,2,0),\"\")","v":""},null,null,null,null,{"$f":"IFERROR(VLOOKUP(ROWS(AJ$2:$AJ514),O514:Q1262,3,0),\"\")","v":""},null,{"$f":"IFERROR(VLOOKUP(ROWS(AL$2:$AL514),N514:Q1262,4,0),\"\")","v":""}]
[null,null,null,null,null,null,null,null,null,null,null,null,null,{"$f":"IF(ISNUMBER(SEARCH($H$16,Q515)),MAX($N$1,N514)+1,0)","v":0},{"$f":"IF(ISNUMBER(SEARCH($H$11,Q515)),MAX($O$1,O514)+1,0)","v":0},0,"Reliance Growth Inst#",5578,null,null,null,null,null,null,null,null,null,null,null,null,{"$f":"IFERROR(VLOOKUP(ROWS($AE$2:AE515),P515:Q1263,2,0),\"\")","v":""},null,null,null,null,{"$f":"IFERROR(VLOOKUP(ROWS(AJ$2:$AJ515),O515:Q1263,3,0),\"\")","v":""},null,{"$f":"IFERROR(VLOOKUP(ROWS(AL$2:$AL515),N515:Q1263,4,0),\"\")","v":""}]
[null,null,null,null,null,null,null,null,null,null,null,null,null,0,0,0,"Reliance Index Nifty",11536,null,null,null,null,null,null,null,null,null,null,null,null,{"$f":"IFERROR(VLOOKUP(ROWS($AE$2:AE516),P516:Q1264,2,0),\"\")","v":""},null,null,null,null,{"$f":"IFERROR(VLOOKUP(ROWS(AJ$2:$AJ516),O516:Q1264,3,0),\"\")","v":""},null,{"$f":"IFERROR(VLOOKUP(ROWS(AL$2:$AL516),N516:Q1264,4,0),\"\")","v":""}]
[null,null,null,null,null,null,null,null,null,null,null,null,null,0,0,0,"Reliance Index Nifty Direct",16856,null,null,null,null,null,null,null,null,null,null,null,null,{"$f":"IFERROR(VLOOKUP(ROWS($AE$2:AE517),P517:Q1265,2,0),\"\")","v":""},null,null,null,null,{"$f":"IFERROR(VLOOKUP(ROWS(AJ$2:$AJ517),O517:Q1265,3,0),\"\")","v":""},null,{"$f":"IFERROR(VLOOKUP(ROWS(AL$2:$AL517),N517:Q1265,4,0),\"\")","v":""}]
[null,null,null,null,null,null,null,null,null,null,null,null,null,0,0,0,"Reliance Index Sensex",11541,null,null,null,null,null,null,null,null,null,null,null,null,{"$f":"IFERROR(VLOOKUP(ROWS($AE$2:AE518),P518:Q1266,2,0),\"\")","v":""},null,null,null,null,{"$f":"IFERROR(VLOOKUP(ROWS(AJ$2:$AJ518),O518:Q1266,3,0),\"\")","v":""},null,{"$f":"IFERROR(VLOOKUP(ROWS(AL$2:$AL518),N518:Q1266,4,0),\"\")","v":""}]
[null,null,null,null,null,null,null,null,null,null,null,null,null,0,0,0,"Reliance Index Sensex Direct",16859,null,null,null,null,null,null,null,null,null,null,null,null,{"$f":"IFERROR(VLOOKUP(ROWS($AE$2:AE519),P519:Q1267,2,0),\"\")","v":""},null,null,null,null,{"$f":"IFERROR(VLOOKUP(ROWS(AJ$2:$AJ519),O519:Q1267,3,0),\"\")","v":""},null,{"$f":"IFERROR(VLOOKUP(ROWS(AL$2:$AL519),N519:Q1267,4,0),\"\")","v":""}]
[null,null,null,null,null,null,null,null,null,null,null,null,null,0,0,0,"Reliance Long Term Equity",3900,null,null,null,null,null,null,null,null,null,null,null,null,{"$f":"IFERROR(VLOOKUP(ROWS($AE$2:AE520),P520:Q1268,2,0),\"\")","v":""},null,null,null,null,{"$f":"IFERROR(VLOOKUP(ROWS(AJ$2:$AJ520),O520:Q1268,3,0),\"\")","v":""},null,{"$f":"IFERROR(VLOOKUP(ROWS(AL$2:$AL520),N520:Q1268,4,0),\"\")","v":""}]
[null,null,null,null,null,null,null,null,null,null,null,null,null,0,0,0,"Reliance Long Term Equity Direct",16129,null,null,null,null,null,null,null,null,null,null,null,null,{"$f":"IFERROR(VLOOKUP(ROWS($AE$2:AE521),P521:Q1269,2,0),\"\")","v":""},null,null,null,null,{"$f":"IFERROR(VLOOKUP(ROWS(AJ$2:$AJ521),O521:Q1269,3,0),\"\")","v":""},null,{"$f":"IFERROR(VLOOKUP(ROWS(AL$2:$AL521),N521:Q1269,4,0),\"\")","v":""}]
[null,null,null,null,null,null,null,null,null,null,null,null,null,0,0,0,"Reliance Media & Entertainment",2474,null,null,null,null,null,null,null,null,null,null,null,null,{"$f":"IFERROR(VLOOKUP(ROWS($AE$2:AE522),P522:Q1270,2,0),\"\")","v":""},null,null,null,null,{"$f":"IFERROR(VLOOKUP(ROWS(AJ$2:$AJ522),O522:Q1270,3,0),\"\")","v":""},null,{"$f":"IFERROR(VLOOKUP(ROWS(AL$2:$AL522),N522:Q1270,4,0),\"\")","v":""}]
[null,null,null,null,null,null,null,null,null,null,null,null,null,0,0,0,"Reliance Media & Entertainment Direct",16131,null,null,null,null,null,null,null,null,null,null,null,null,{"$f":"IFERROR(VLOOKUP(ROWS($AE$2:AE523),P523:Q1271,2,0),\"\")","v":""},null,null,null,null,{"$f":"IFERROR(VLOOKUP(ROWS(AJ$2:$AJ523),O523:Q1271,3,0),\"\")","v":""},null,{"$f":"IFERROR(VLOOKUP(ROWS(AL$2:$AL523),N523:Q1271,4,0),\"\")","v":""}]
[null,null,null,null,null,null,null,null,null,null,null,null,null,0,0,0,"Reliance NRI Equity",2510,null,null,null,null,null,null,null,null,null,null,null,null,{"$f":"IFERROR(VLOOKUP(ROWS($AE$2:AE524),P524:Q1272,2,0),\"\")","v":""},null,null,null,null,{"$f":"IFERROR(VLOOKUP(ROWS(AJ$2:$AJ524),O524:Q1272,3,0),\"\")","v":""},null,{"$f":"IFERROR(VLOOKUP(ROWS(AL$2:$AL524),N524:Q1272,4,0),\"\")","v":""}]
[null,null,null,null,null,null,null,null,null,null,null,null,null,0,0,0,"Reliance NRI Equity Direct",17097,null,null,null,null,null,null,null,null,null,null,null,null,{"$f":"IFERROR(VLOOKUP(ROWS($AE$2:AE525),P525:Q1273,2,0),\"\")","v":""},null,null,null,null,{"$f":"IFERROR(VLOOKUP(ROWS(AJ$2:$AJ525),O525:Q1273,3,0),\"\")","v":""},null,{"$f":"IFERROR(VLOOKUP(ROWS(AL$2:$AL525),N525:Q1273,4,0),\"\")","v":""}]
[null,null,null,null,null,null,null,null,null,null,null,null,null,0,0,0,"Reliance Pharma",2241,null,null,null,null,null,null,null,null,null,null,null,null,{"$f":"IFERROR(VLOOKUP(ROWS($AE$2:AE526),P526:Q1274,2,0),\"\")","v":""},null,null,null,null,{"$f":"IFERROR(VLOOKUP(ROWS(AJ$2:$AJ526),O526:Q1274,3,0),\"\")","v":""},null,{"$f":"IFERROR(VLOOKUP(ROWS(AL$2:$AL526),N526:Q1274,4,0),\"\")","v":""}]
[null,null,null,null,null,null,null,null,null,null,null,null,null,0,0,0,"Reliance Pharma Direct",16150,null,null,null,null,null,null,null,null,null,null,null,null,{"$f":"IFERROR(VLOOKUP(ROWS($AE$2:AE527),P527:Q1275,2,0),\"\")","v":""},null,null,null,null,{"$f":"IFERROR(VLOOKUP(ROWS(AJ$2:$AJ527),O527:Q1275,3,0),\"\")","v":""},null,{"$f":"IFERROR(VLOOKUP(ROWS(AL$2:$AL527),N527:Q1275,4,0),\"\")","v":""}]
[null,null,null,null,null,null,null,null,null,null,null,null,null,0,0,0,"Reliance Quant Plus Retail",7591,null,null,null,null,null,null,null,null,null,null,null,null,{"$f":"IFERROR(VLOOKUP(ROWS($AE$2:AE528),P528:Q1276,2,0),\"\")","v":""},null,null,null,null,{"$f":"IFERROR(VLOOKUP(ROWS(AJ$2:$AJ528),O528:Q1276,3,0),\"\")","v":""},null,{"$f":"IFERROR(VLOOKUP(ROWS(AL$2:$AL528),N528:Q1276,4,0),\"\")","v":""}]
[null,null,null,null,null,null,null,null,null,null,null,null,null,0,0,0,"Reliance Quant Plus Retail Direct",16155,null,null,null,null,null,null,null,null,null,null,null,null,{"$f":"IFERROR(VLOOKUP(ROWS($AE$2:AE529),P529:Q1277,2,0),\"\")","v":""},null,null,null,null,{"$f":"IFERROR(VLOOKUP(ROWS(AJ$2:$AJ529),O529:Q1277,3,0),\"\")","v":""},null,{"$f":"IFERROR(VLOOKUP(ROWS(AL$2:$AL529),N529:Q1277,4,0),\"\")","v":""}]
[null,null,null,null,null,null,null,null,null,null,null,null,null,0,0,0,"Reliance Regular Savings Equity",2790,null,null,null,null,null,null,null,null,null,null,null,null,{"$f":"IFERROR(VLOOKUP(ROWS($AE$2:AE530),P530:Q1278,2,0),\"\")","v":""},null,null,null,null,{"$f":"IFERROR(VLOOKUP(ROWS(AJ$2:$AJ530),O530:Q1278,3,0),\"\")","v":""},null,{"$f":"IFERROR(VLOOKUP(ROWS(AL$2:$AL530),N530:Q1278,4,0),\"\")","v":""}]
[null,null,null,null,null,null,null,null,null,null,null,null,null,0,0,0,"Reliance Regular Savings Equity Direct",16175,null,null,null,null,null,null,null,null,null,null,null,null,{"$f":"IFERROR(VLOOKUP(ROWS($AE$2:AE531),P531:Q1279,2,0),\"\")","v":""},null,null,null,null,{"$f":"IFERROR(VLOOKUP(ROWS(AJ$2:$AJ531),O531:Q1279,3,0),\"\")","v":""},null,{"$f":"IFERROR(VLOOKUP(ROWS(AL$2:$AL531),N531:Q1279,4,0),\"\")","v":""}]
[null,null,null,null,null,null,null,null,null,null,null,null,null,0,0,0,"Reliance Small Cap",11463,null,null,null,null,null,null,null,null,null,null,null,null,{"$f":"IFERROR(VLOOKUP(ROWS($AE$2:AE532),P532:Q1280,2,0),\"\")","v":""},null,null,null,null,{"$f":"IFERROR(VLOOKUP(ROWS(AJ$2:$AJ532),O532:Q1280,3,0),\"\")","v":""},null,{"$f":"IFERROR(VLOOKUP(ROWS(AL$2:$AL532),N532:Q1280,4,0),\"\")","v":""}]
[null,null,null,null,null,null,null,null,null,null,null,null,null,0,0,0,"Reliance Small Cap Direct",16182,null,null,null,null,null,null,null,null,null,null,null,null,{"$f":"IFERROR(VLOOKUP(ROWS($AE$2:AE533),P533:Q1281,2,0),\"\")","v":""},null,null,null,null,{"$f":"IFERROR(VLOOKUP(ROWS(AJ$2:$AJ533),O533:Q1281,3,0),\"\")","v":""},null,{"$f":"IFERROR(VLOOKUP(ROWS(AL$2:$AL533),N533:Q1281,4,0),\"\")","v":""}]
[null,null,null,null,null,null,null,null,null,null,null,null,null,0,0,0,"Reliance Tax Saver",2816,null,null,null,null,null,null,null,null,null,null,null,null,{"$f":"IFERROR(VLOOKUP(ROWS($AE$2:AE534),P534:Q1282,2,0),\"\")","v":""},null,null,null,null,{"$f":"IFERROR(VLOOKUP(ROWS(AJ$2:$AJ534),O534:Q1282,3,0),\"\")","v":""},null,{"$f":"IFERROR(VLOOKUP(ROWS(AL$2:$AL534),N534:Q1282,4,0),\"\")","v":""}]
[null,null,null,null,null,null,null,null,null,null,null,null,null,0,0,0,"Reliance Tax Saver Direct",16186,null,null,null,null,null,null,null,null,null,null,null,null,{"$f":"IFERROR(VLOOKUP(ROWS($AE$2:AE535),P535:Q1283,2,0),\"\")","v":""},null,null,null,null,{"$f":"IFERROR(VLOOKUP(ROWS(AJ$2:$AJ535),O535:Q1283,3,0),\"\")","v":""},null,{"$f":"IFERROR(VLOOKUP(ROWS(AL$2:$AL535),N535:Q1283,4,0),\"\")","v":""}]
[null,null,null,null,null,null,null,null,null,null,null,null,null,0,0,0,"Reliance Top 200 Retail",5270,null,null,null,null,null,null,null,null,null,null,null,null,{"$f":"IFERROR(VLOOKUP(ROWS($AE$2:AE536),P536:Q1284,2,0),\"\")","v":""},null,null,null,null,{"$f":"IFERROR(VLOOKUP(ROWS(AJ$2:$AJ536),O536:Q1284,3,0),\"\")","v":""},null,{"$f":"IFERROR(VLOOKUP(ROWS(AL$2:$AL536),N536:Q1284,4,0),\"\")","v":""}]
[null,null,null,null,null,null,null,null,null,null,null,null,null,0,0,0,"Reliance Top 200 Retail Direct",16192,null,null,null,null,null,null,null,null,null,null,null,null,{"$f":"IFERROR(VLOOKUP(ROWS($AE$2:AE537),P537:Q1285,2,0),\"\")","v":""},null,null,null,null,{"$f":"IFERROR(VLOOKUP(ROWS(AJ$2:$AJ537),O537:Q1285,3,0),\"\")","v":""},null,{"$f":"IFERROR(VLOOKUP(ROWS(AL$2:$AL537),N537:Q1285,4,0),\"\")","v":""}]
[null,null,null,null,null,null,null,null,null,null,null,null,null,0,0,0,"Reliance Vision",182,null,null,null,null,null,null,null,null,null,null,null,null,{"$f":"IFERROR(VLOOKUP(ROWS($AE$2:AE538),P538:Q1286,2,0),\"\")","v":""},null,null,null,null,{"$f":"IFERROR(VLOOKUP(ROWS(AJ$2:$AJ538),O538:Q1286,3,0),\"\")","v":""},null,{"$f":"IFERROR(VLOOKUP(ROWS(AL$2:$AL538),N538:Q1286,4,0),\"\")","v":""}]
[null,null,null,null,null,null,null,null,null,null,null,null,null,0,0,0,"Reliance Vision Direct",16194,null,null,null,null,null,null,null,null,null,null,null,null,{"$f":"IFERROR(VLOOKUP(ROWS($AE$2:AE539),P539:Q1287,2,0),\"\")","v":""},null,null,null,null,{"$f":"IFERROR(VLOOKUP(ROWS(AJ$2:$AJ539),O539:Q1287,3,0),\"\")","v":""},null,{"$f":"IFERROR(VLOOKUP(ROWS(AL$2:$AL539),N539:Q1287,4,0),\"\")","v":""}]
[null,null,null,null,null,null,null,null,null,null,null,null,null,0,0,0,"Reliance Vision Inst#",5581,null,null,null,null,null,null,null,null,null,null,null,null,{"$f":"IFERROR(VLOOKUP(ROWS($AE$2:AE540),P540:Q1288,2,0),\"\")","v":""},null,null,null,null,{"$f":"IFERROR(VLOOKUP(ROWS(AJ$2:$AJ540),O540:Q1288,3,0),\"\")","v":""},null,{"$f":"IFERROR(VLOOKUP(ROWS(AL$2:$AL540),N540:Q1288,4,0),\"\")","v":""}]
[null,null,null,null,null,null,null,null,null,null,null,null,null,0,0,0,"Religare Invesco AGILE",6115,null,null,null,null,null,null,null,null,null,null,null,null,{"$f":"IFERROR(VLOOKUP(ROWS($AE$2:AE541),P541:Q1289,2,0),\"\")","v":""},null,null,null,null,{"$f":"IFERROR(VLOOKUP(ROWS(AJ$2:$AJ541),O541:Q1289,3,0),\"\")","v":""},null,{"$f":"IFERROR(VLOOKUP(ROWS(AL$2:$AL541),N541:Q1289,4,0),\"\")","v":""}]
[null,null,null,null,null,null,null,null,null,null,null,null,null,0,0,0,"Religare Invesco AGILE Direct",16360,null,null,null,null,null,null,null,null,null,null,null,null,{"$f":"IFERROR(VLOOKUP(ROWS($AE$2:AE542),P542:Q1290,2,0),\"\")","v":""},null,null,null,null,{"$f":"IFERROR(VLOOKUP(ROWS(AJ$2:$AJ542),O542:Q1290,3,0),\"\")","v":""},null,{"$f":"IFERROR(VLOOKUP(ROWS(AL$2:$AL542),N542:Q1290,4,0),\"\")","v":""}]
[null,null,null,null,null,null,null,null,null,null,null,null,null,0,0,0,"Religare Invesco Banking",7830,null,null,null,null,null,null,null,null,null,null,null,null,{"$f":"IFERROR(VLOOKUP(ROWS($AE$2:AE543),P543:Q1291,2,0),\"\")","v":""},null,null,null,null,{"$f":"IFERROR(VLOOKUP(ROWS(AJ$2:$AJ543),O543:Q1291,3,0),\"\")","v":""},null,{"$f":"IFERROR(VLOOKUP(ROWS(AL$2:$AL543),N543:Q1291,4,0),\"\")","v":""}]
[null,null,null,null,null,null,null,null,null,null,null,null,null,0,0,0,"Religare Invesco Banking Direct",16702,null,null,null,null,null,null,null,null,null,null,null,null,{"$f":"IFERROR(VLOOKUP(ROWS($AE$2:AE544),P544:Q1292,2,0),\"\")","v":""},null,null,null,null,{"$f":"IFERROR(VLOOKUP(ROWS(AJ$2:$AJ544),O544:Q1292,3,0),\"\")","v":""},null,{"$f":"IFERROR(VLOOKUP(ROWS(AL$2:$AL544),N544:Q1292,4,0),\"\")","v":""}]
[null,null,null,null,null,null,null,null,null,null,null,null,null,0,0,0,"Religare Invesco Business Leaders",10565,null,null,null,null,null,null,null,null,null,null,null,null,{"$f":"IFERROR(VLOOKUP(ROWS($AE$2:AE545),P545:Q1293,2,0),\"\")","v":""},null,null,null,null,{"$f":"IFERROR(VLOOKUP(ROWS(AJ$2:$AJ545),O545:Q1293,3,0),\"\")","v":""},null,{"$f":"IFERROR(VLOOKUP(ROWS(AL$2:$AL545),N545:Q1293,4,0),\"\")","v":""}]
[null,null,null,null,null,null,null,null,null,null,null,null,null,0,0,0,"Religare Invesco Business Leaders Direct",16712,null,null,null,null,null,null,null,null,null,null,null,null,{"$f":"IFERROR(VLOOKUP(ROWS($AE$2:AE546),P546:Q1294,2,0),\"\")","v":""},null,null,null,null,{"$f":"IFERROR(VLOOKUP(ROWS(AJ$2:$AJ546),O546:Q1294,3,0),\"\")","v":""},null,{"$f":"IFERROR(VLOOKUP(ROWS(AL$2:$AL546),N546:Q1294,4,0),\"\")","v":""}]
[null,null,null,null,null,null,null,null,null,null,null,null,null,0,0,0,"Religare Invesco Contra",4278,null,null,null,null,null,null,null,null,null,null,null,null,{"$f":"IFERROR(VLOOKUP(ROWS($AE$2:AE547),P547:Q1295,2,0),\"\")","v":""},null,null,null,null,{"$f":"IFERROR(VLOOKUP(ROWS(AJ$2:$AJ547),O547:Q1295,3,0),\"\")","v":""},null,{"$f":"IFERROR(VLOOKUP(ROWS(AL$2:$AL547),N547:Q1295,4,0),\"\")","v":""}]
[null,null,null,null,null,null,null,null,null,null,null,null,null,0,0,0,"Religare Invesco Contra Direct",16719,null,null,null,null,null,null,null,null,null,null,null,null,{"$f":"IFERROR(VLOOKUP(ROWS($AE$2:AE548),P548:Q1296,2,0),\"\")","v":""},null,null,null,null,{"$f":"IFERROR(VLOOKUP(ROWS(AJ$2:$AJ548),O548:Q1296,3,0),\"\")","v":""},null,{"$f":"IFERROR(VLOOKUP(ROWS(AL$2:$AL548),N548:Q1296,4,0),\"\")","v":""}]
[null,null,null,null,null,null,null,null,null,null,null,null,null,0,0,0,"Religare Invesco Equity",5566,null,null,null,null,null,null,null,null,null,null,null,null,{"$f":"IFERROR(VLOOKUP(ROWS($AE$2:AE549),P549:Q1297,2,0),\"\")","v":""},null,null,null,null,{"$f":"IFERROR(VLOOKUP(ROWS(AJ$2:$AJ549),O549:Q1297,3,0),\"\")","v":""},null,{"$f":"IFERROR(VLOOKUP(ROWS(AL$2:$AL549),N549:Q1297,4,0),\"\")","v":""}]
[null,null,null,null,null,null,null,null,null,null,null,null,null,0,0,0,"Religare Invesco Equity Direct",16740,null,null,null,null,null,null,null,null,null,null,null,null,{"$f":"IFERROR(VLOOKUP(ROWS($AE$2:AE550),P550:Q1298,2,0),\"\")","v":""},null,null,null,null,{"$f":"IFERROR(VLOOKUP(ROWS(AJ$2:$AJ550),O550:Q1298,3,0),\"\")","v":""},null,{"$f":"IFERROR(VLOOKUP(ROWS(AL$2:$AL550),N550:Q1298,4,0),\"\")","v":""}]
[null,null,null,null,null,null,null,null,null,null,null,null,null,0,0,0,"Religare Invesco Growth",5346,null,null,null,null,null,null,null,null,null,null,null,null,{"$f":"IFERROR(VLOOKUP(ROWS($AE$2:AE551),P551:Q1299,2,0),\"\")","v":""},null,null,null,null,{"$f":"IFERROR(VLOOKUP(ROWS(AJ$2:$AJ551),O551:Q1299,3,0),\"\")","v":""},null,{"$f":"IFERROR(VLOOKUP(ROWS(AL$2:$AL551),N551:Q1299,4,0),\"\")","v":""}]
[null,null,null,null,null,null,null,null,null,null,null,null,null,0,0,0,"Religare Invesco Growth Direct",16770,null,null,null,null,null,null,null,null,null,null,null,null,{"$f":"IFERROR(VLOOKUP(ROWS($AE$2:AE552),P552:Q1300,2,0),\"\")","v":""},null,null,null,null,{"$f":"IFERROR(VLOOKUP(ROWS(AJ$2:$AJ552),O552:Q1300,3,0),\"\")","v":""},null,{"$f":"IFERROR(VLOOKUP(ROWS(AL$2:$AL552),N552:Q1300,4,0),\"\")","v":""}]
[null,null,null,null,null,null,null,null,null,null,null,null,null,0,0,0,"Religare Invesco Infrastructure",5882,null,null,null,null,null,null,null,null,null,null,null,null,{"$f":"IFERROR(VLOOKUP(ROWS($AE$2:AE553),P553:Q1301,2,0),\"\")","v":""},null,null,null,null,{"$f":"IFERROR(VLOOKUP(ROWS(AJ$2:$AJ553),O553:Q1301,3,0),\"\")","v":""},null,{"$f":"IFERROR(VLOOKUP(ROWS(AL$2:$AL553),N553:Q1301,4,0),\"\")","v":""}]
[null,null,null,null,null,null,null,null,null,null,null,null,null,0,0,0,"Religare Invesco Infrastructure Direct",16774,null,null,null,null,null,null,null,null,null,null,null,null,{"$f":"IFERROR(VLOOKUP(ROWS($AE$2:AE554),P554:Q1302,2,0),\"\")","v":""},null,null,null,null,{"$f":"IFERROR(VLOOKUP(ROWS(AJ$2:$AJ554),O554:Q1302,3,0),\"\")","v":""},null,{"$f":"IFERROR(VLOOKUP(ROWS(AL$2:$AL554),N554:Q1302,4,0),\"\")","v":""}]
[null,null,null,null,null,null,null,null,null,null,null,null,null,0,0,0,"Religare Invesco Mid Cap",4280,null,null,null,null,null,null,null,null,null,null,null,null,{"$f":"IFERROR(VLOOKUP(ROWS($AE$2:AE555),P555:Q1303,2,0),\"\")","v":""},null,null,null,null,{"$f":"IFERROR(VLOOKUP(ROWS(AJ$2:$AJ555),O555:Q1303,3,0),\"\")","v":""},null,{"$f":"IFERROR(VLOOKUP(ROWS(AL$2:$AL555),N555:Q1303,4,0),\"\")","v":""}]
[null,null,null,null,null,null,null,null,null,null,null,null,null,0,0,0,"Religare Invesco Mid Cap Direct",16807,null,null,null,null,null,null,null,null,null,null,null,null,{"$f":"IFERROR(VLOOKUP(ROWS($AE$2:AE556),P556:Q1304,2,0),\"\")","v":""},null,null,null,null,{"$f":"IFERROR(VLOOKUP(ROWS(AJ$2:$AJ556),O556:Q1304,3,0),\"\")","v":""},null,{"$f":"IFERROR(VLOOKUP(ROWS(AL$2:$AL556),N556:Q1304,4,0),\"\")","v":""}]
[null,null,null,null,null,null,null,null,null,null,null,null,null,0,0,0,"Religare Invesco Mid N Small Cap",6675,null,null,null,null,null,null,null,null,null,null,null,null,{"$f":"IFERROR(VLOOKUP(ROWS($AE$2:AE557),P557:Q1305,2,0),\"\")","v":""},null,null,null,null,{"$f":"IFERROR(VLOOKUP(ROWS(AJ$2:$AJ557),O557:Q1305,3,0),\"\")","v":""},null,{"$f":"IFERROR(VLOOKUP(ROWS(AL$2:$AL557),N557:Q1305,4,0),\"\")","v":""}]
[null,null,null,null,null,null,null,null,null,null,null,null,null,0,0,0,"Religare Invesco Mid N Small Cap Direct",16811,null,null,null,null,null,null,null,null,null,null,null,null,{"$f":"IFERROR(VLOOKUP(ROWS($AE$2:AE558),P558:Q1306,2,0),\"\")","v":""},null,null,null,null,{"$f":"IFERROR(VLOOKUP(ROWS(AJ$2:$AJ558),O558:Q1306,3,0),\"\")","v":""},null,{"$f":"IFERROR(VLOOKUP(ROWS(AL$2:$AL558),N558:Q1306,4,0),\"\")","v":""}]
[null,null,null,null,null,null,null,null,null,null,null,null,null,0,0,0,"Religare Invesco Nifty ETF",12761,null,null,null,null,null,null,null,null,null,null,null,null,{"$f":"IFERROR(VLOOKUP(ROWS($AE$2:AE559),P559:Q1307,2,0),\"\")","v":""},null,null,null,null,{"$f":"IFERROR(VLOOKUP(ROWS(AJ$2:$AJ559),O559:Q1307,3,0),\"\")","v":""},null,{"$f":"IFERROR(VLOOKUP(ROWS(AL$2:$AL559),N559:Q1307,4,0),\"\")","v":""}]
[null,null,null,null,null,null,null,null,null,null,null,null,null,0,0,0,"Religare Invesco PSU Equity",10694,null,null,null,null,null,null,null,null,null,null,null,null,{"$f":"IFERROR(VLOOKUP(ROWS($AE$2:AE560),P560:Q1308,2,0),\"\")","v":""},null,null,null,null,{"$f":"IFERROR(VLOOKUP(ROWS(AJ$2:$AJ560),O560:Q1308,3,0),\"\")","v":""},null,{"$f":"IFERROR(VLOOKUP(ROWS(AL$2:$AL560),N560:Q1308,4,0),\"\")","v":""}]
[null,null,null,null,null,null,null,null,null,null,null,null,null,0,0,0,"Religare Invesco PSU Equity Direct",16831,null,null,null,null,null,null,null,null,null,null,null,null,{"$f":"IFERROR(VLOOKUP(ROWS($AE$2:AE561),P561:Q1309,2,0),\"\")","v":""},null,null,null,null,{"$f":"IFERROR(VLOOKUP(ROWS(AJ$2:$AJ561),O561:Q1309,3,0),\"\")","v":""},null,{"$f":"IFERROR(VLOOKUP(ROWS(AL$2:$AL561),N561:Q1309,4,0),\"\")","v":""}]
[null,null,null,null,null,null,null,null,null,null,null,null,null,0,0,0,"Religare Invesco Tax Plan",3913,null,null,null,null,null,null,null,null,null,null,null,null,{"$f":"IFERROR(VLOOKUP(ROWS($AE$2:AE562),P562:Q1310,2,0),\"\")","v":""},null,null,null,null,{"$f":"IFERROR(VLOOKUP(ROWS(AJ$2:$AJ562),O562:Q1310,3,0),\"\")","v":""},null,{"$f":"IFERROR(VLOOKUP(ROWS(AL$2:$AL562),N562:Q1310,4,0),\"\")","v":""}]
[null,null,null,null,null,null,null,null,null,null,null,null,null,0,0,0,"Religare Invesco Tax Plan Direct",16849,null,null,null,null,null,null,null,null,null,null,null,null,{"$f":"IFERROR(VLOOKUP(ROWS($AE$2:AE563),P563:Q1311,2,0),\"\")","v":""},null,null,null,null,{"$f":"IFERROR(VLOOKUP(ROWS(AJ$2:$AJ563),O563:Q1311,3,0),\"\")","v":""},null,{"$f":"IFERROR(VLOOKUP(ROWS(AL$2:$AL563),N563:Q1311,4,0),\"\")","v":""}]
[null,null,null,null,null,null,null,null,null,null,null,null,null,0,0,0,"Sahara Banking and Financial Services",8554,null,null,null,null,null,null,null,null,null,null,null,null,{"$f":"IFERROR(VLOOKUP(ROWS($AE$2:AE564),P564:Q1312,2,0),\"\")","v":""},null,null,null,null,{"$f":"IFERROR(VLOOKUP(ROWS(AJ$2:$AJ564),O564:Q1312,3,0),\"\")","v":""},null,{"$f":"IFERROR(VLOOKUP(ROWS(AL$2:$AL564),N564:Q1312,4,0),\"\")","v":""}]
[null,null,null,null,null,null,null,null,null,null,null,null,null,0,0,0,"Sahara Banking and Financial Services Direct",15601,null,null,null,null,null,null,null,null,null,null,null,null,{"$f":"IFERROR(VLOOKUP(ROWS($AE$2:AE565),P565:Q1313,2,0),\"\")","v":""},null,null,null,null,{"$f":"IFERROR(VLOOKUP(ROWS(AJ$2:$AJ565),O565:Q1313,3,0),\"\")","v":""},null,{"$f":"IFERROR(VLOOKUP(ROWS(AL$2:$AL565),N565:Q1313,4,0),\"\")","v":""}]
[null,null,null,null,null,null,null,null,null,null,null,null,null,0,0,0,"Sahara Growth",1390,null,null,null,null,null,null,null,null,null,null,null,null,{"$f":"IFERROR(VLOOKUP(ROWS($AE$2:AE566),P566:Q1314,2,0),\"\")","v":""},null,null,null,null,{"$f":"IFERROR(VLOOKUP(ROWS(AJ$2:$AJ566),O566:Q1314,3,0),\"\")","v":""},null,{"$f":"IFERROR(VLOOKUP(ROWS(AL$2:$AL566),N566:Q1314,4,0),\"\")","v":""}]
[null,null,null,null,null,null,null,null,null,null,null,null,null,0,0,0,"Sahara Growth Direct",15610,null,null,null,null,null,null,null,null,null,null,null,null,{"$f":"IFERROR(VLOOKUP(ROWS($AE$2:AE567),P567:Q1315,2,0),\"\")","v":""},null,null,null,null,{"$f":"IFERROR(VLOOKUP(ROWS(AJ$2:$AJ567),O567:Q1315,3,0),\"\")","v":""},null,{"$f":"IFERROR(VLOOKUP(ROWS(AL$2:$AL567),N567:Q1315,4,0),\"\")","v":""}]
[null,null,null,null,null,null,null,null,null,null,null,null,null,0,0,0,"Sahara Infrastructure Fixed Pricing",3192,null,null,null,null,null,null,null,null,null,null,null,null,{"$f":"IFERROR(VLOOKUP(ROWS($AE$2:AE568),P568:Q1316,2,0),\"\")","v":""},null,null,null,null,{"$f":"IFERROR(VLOOKUP(ROWS(AJ$2:$AJ568),O568:Q1316,3,0),\"\")","v":""},null,{"$f":"IFERROR(VLOOKUP(ROWS(AL$2:$AL568),N568:Q1316,4,0),\"\")","v":""}]
[null,null,null,null,null,null,null,null,null,null,null,null,null,0,0,0,"Sahara Infrastructure Fixed Pricing Direct",15618,null,null,null,null,null,null,null,null,null,null,null,null,{"$f":"IFERROR(VLOOKUP(ROWS($AE$2:AE569),P569:Q1317,2,0),\"\")","v":""},null,null,null,null,{"$f":"IFERROR(VLOOKUP(ROWS(AJ$2:$AJ569),O569:Q1317,3,0),\"\")","v":""},null,{"$f":"IFERROR(VLOOKUP(ROWS(AL$2:$AL569),N569:Q1317,4,0),\"\")","v":""}]
[null,null,null,null,null,null,null,null,null,null,null,null,null,0,0,0,"Sahara Infrastructure Variable Pricing",3194,null,null,null,null,null,null,null,null,null,null,null,null,{"$f":"IFERROR(VLOOKUP(ROWS($AE$2:AE570),P570:Q1318,2,0),\"\")","v":""},null,null,null,null,{"$f":"IFERROR(VLOOKUP(ROWS(AJ$2:$AJ570),O570:Q1318,3,0),\"\")","v":""},null,{"$f":"IFERROR(VLOOKUP(ROWS(AL$2:$AL570),N570:Q1318,4,0),\"\")","v":""}]
[null,null,null,null,null,null,null,null,null,null,null,null,null,0,0,0,"Sahara Infrastructure Variable Pricing Direct",15622,null,null,null,null,null,null,null,null,null,null,null,null,{"$f":"IFERROR(VLOOKUP(ROWS($AE$2:AE571),P571:Q1319,2,0),\"\")","v":""},null,null,null,null,{"$f":"IFERROR(VLOOKUP(ROWS(AJ$2:$AJ571),O571:Q1319,3,0),\"\")","v":""},null,{"$f":"IFERROR(VLOOKUP(ROWS(AL$2:$AL571),N571:Q1319,4,0),\"\")","v":""}]
[null,null,null,null,null,null,null,null,null,null,null,null,null,0,0,0,"Sahara Mid-Cap Direct",15642,null,null,null,null,null,null,null,null,null,null,null,null,{"$f":"IFERROR(VLOOKUP(ROWS($AE$2:AE572),P572:Q1320,2,0),\"\")","v":""},null,null,null,null,{"$f":"IFERROR(VLOOKUP(ROWS(AJ$2:$AJ572),O572:Q1320,3,0),\"\")","v":""},null,{"$f":"IFERROR(VLOOKUP(ROWS(AL$2:$AL572),N572:Q1320,4,0),\"\")","v":""}]
[null,null,null,null,null,null,null,null,null,null,null,null,null,0,0,0,"Sahara Mid-Cap Fund",2553,null,null,null,null,null,null,null,null,null,null,null,null,{"$f":"IFERROR(VLOOKUP(ROWS($AE$2:AE573),P573:Q1321,2,0),\"\")","v":""},null,null,null,null,{"$f":"IFERROR(VLOOKUP(ROWS(AJ$2:$AJ573),O573:Q1321,3,0),\"\")","v":""},null,{"$f":"IFERROR(VLOOKUP(ROWS(AL$2:$AL573),N573:Q1321,4,0),\"\")","v":""}]
[null,null,null,null,null,null,null,null,null,null,null,null,null,0,0,0,"Sahara Power & Natural Resources",7712,null,null,null,null,null,null,null,null,null,null,null,null,{"$f":"IFERROR(VLOOKUP(ROWS($AE$2:AE574),P574:Q1322,2,0),\"\")","v":""},null,null,null,null,{"$f":"IFERROR(VLOOKUP(ROWS(AJ$2:$AJ574),O574:Q1322,3,0),\"\")","v":""},null,{"$f":"IFERROR(VLOOKUP(ROWS(AL$2:$AL574),N574:Q1322,4,0),\"\")","v":""}]
[null,null,null,null,null,null,null,null,null,null,null,null,null,0,0,0,"Sahara Power & Natural Resources Direct",15648,null,null,null,null,null,null,null,null,null,null,null,null,{"$f":"IFERROR(VLOOKUP(ROWS($AE$2:AE575),P575:Q1323,2,0),\"\")","v":""},null,null,null,null,{"$f":"IFERROR(VLOOKUP(ROWS(AJ$2:$AJ575),O575:Q1323,3,0),\"\")","v":""},null,{"$f":"IFERROR(VLOOKUP(ROWS(AL$2:$AL575),N575:Q1323,4,0),\"\")","v":""}]
[null,null,null,null,null,null,null,null,null,null,null,null,null,0,0,0,"Sahara R.E.A.L",6054,null,null,null,null,null,null,null,null,null,null,null,null,{"$f":"IFERROR(VLOOKUP(ROWS($AE$2:AE576),P576:Q1324,2,0),\"\")","v":""},null,null,null,null,{"$f":"IFERROR(VLOOKUP(ROWS(AJ$2:$AJ576),O576:Q1324,3,0),\"\")","v":""},null,{"$f":"IFERROR(VLOOKUP(ROWS(AL$2:$AL576),N576:Q1324,4,0),\"\")","v":""}]
[null,null,null,null,null,null,null,null,null,null,null,null,null,0,0,0,"Sahara R.E.A.L Direct",15651,null,null,null,null,null,null,null,null,null,null,null,null,{"$f":"IFERROR(VLOOKUP(ROWS($AE$2:AE577),P577:Q1325,2,0),\"\")","v":""},null,null,null,null,{"$f":"IFERROR(VLOOKUP(ROWS(AJ$2:$AJ577),O577:Q1325,3,0),\"\")","v":""},null,{"$f":"IFERROR(VLOOKUP(ROWS(AL$2:$AL577),N577:Q1325,4,0),\"\")","v":""}]
[null,null,null,null,null,null,null,null,null,null,null,null,null,0,0,{"$f":"IF(ISNUMBER(SEARCH($H$6,Q578)),MAX($P$1,P577)+1,0)","v":0},"Sahara Star Value",10605,null,null,null,null,null,null,null,null,null,null,null,null,{"$f":"IFERROR(VLOOKUP(ROWS($AE$2:AE578),P578:Q1326,2,0),\"\")","v":""},null,null,null,null,{"$f":"IFERROR(VLOOKUP(ROWS(AJ$2:$AJ578),O578:Q1326,3,0),\"\")","v":""},null,{"$f":"IFERROR(VLOOKUP(ROWS(AL$2:$AL578),N578:Q1326,4,0),\"\")","v":""}]
[null,null,null,null,null,null,null,null,null,null,null,null,null,{"$f":"IF(ISNUMBER(SEARCH($H$16,Q579)),MAX($N$1,N578)+1,0)","v":0},{"$f":"IF(ISNUMBER(SEARCH($H$11,Q579)),MAX($O$1,O578)+1,0)","v":0},0,"Sahara Star Value Direct",15655,null,null,null,null,null,null,null,null,null,null,null,null,{"$f":"IFERROR(VLOOKUP(ROWS($AE$2:AE579),P579:Q1327,2,0),\"\")","v":""},null,null,null,null,{"$f":"IFERROR(VLOOKUP(ROWS(AJ$2:$AJ579),O579:Q1327,3,0),\"\")","v":""},null,{"$f":"IFERROR(VLOOKUP(ROWS(AL$2:$AL579),N579:Q1327,4,0),\"\")","v":""}]
[null,null,null,null,null,null,null,null,null,null,null,null,null,0,0,0,"Sahara Super 20",10538,null,null,null,null,null,null,null,null,null,null,null,null,{"$f":"IFERROR(VLOOKUP(ROWS($AE$2:AE580),P580:Q1328,2,0),\"\")","v":""},null,null,null,null,{"$f":"IFERROR(VLOOKUP(ROWS(AJ$2:$AJ580),O580:Q1328,3,0),\"\")","v":""},null,{"$f":"IFERROR(VLOOKUP(ROWS(AL$2:$AL580),N580:Q1328,4,0),\"\")","v":""}]
[null,null,null,null,null,null,null,null,null,null,null,null,null,0,0,0,"Sahara Super 20 Direct",15657,null,null,null,null,null,null,null,null,null,null,null,null,{"$f":"IFERROR(VLOOKUP(ROWS($AE$2:AE581),P581:Q1329,2,0),\"\")","v":""},null,null,null,null,{"$f":"IFERROR(VLOOKUP(ROWS(AJ$2:$AJ581),O581:Q1329,3,0),\"\")","v":""},null,{"$f":"IFERROR(VLOOKUP(ROWS(AL$2:$AL581),N581:Q1329,4,0),\"\")","v":""}]
[null,null,null,null,null,null,null,null,null,null,null,null,null,0,0,0,"Sahara Tax Gain",409,null,null,null,null,null,null,null,null,null,null,null,null,{"$f":"IFERROR(VLOOKUP(ROWS($AE$2:AE582),P582:Q1330,2,0),\"\")","v":""},null,null,null,null,{"$f":"IFERROR(VLOOKUP(ROWS(AJ$2:$AJ582),O582:Q1330,3,0),\"\")","v":""},null,{"$f":"IFERROR(VLOOKUP(ROWS(AL$2:$AL582),N582:Q1330,4,0),\"\")","v":""}]
[null,null,null,null,null,null,null,null,null,null,null,null,null,0,0,0,"Sahara Tax Gain Direct",15659,null,null,null,null,null,null,null,null,null,null,null,null,{"$f":"IFERROR(VLOOKUP(ROWS($AE$2:AE583),P583:Q1331,2,0),\"\")","v":""},null,null,null,null,{"$f":"IFERROR(VLOOKUP(ROWS(AJ$2:$AJ583),O583:Q1331,3,0),\"\")","v":""},null,{"$f":"IFERROR(VLOOKUP(ROWS(AL$2:$AL583),N583:Q1331,4,0),\"\")","v":""}]
[null,null,null,null,null,null,null,null,null,null,null,null,null,0,0,0,"Sahara Wealth Plus Fixed Pricing",2810,null,null,null,null,null,null,null,null,null,null,null,null,{"$f":"IFERROR(VLOOKUP(ROWS($AE$2:AE584),P584:Q1332,2,0),\"\")","v":""},null,null,null,null,{"$f":"IFERROR(VLOOKUP(ROWS(AJ$2:$AJ584),O584:Q1332,3,0),\"\")","v":""},null,{"$f":"IFERROR(VLOOKUP(ROWS(AL$2:$AL584),N584:Q1332,4,0),\"\")","v":""}]
[null,null,null,null,null,null,null,null,null,null,null,null,null,0,0,0,"Sahara Wealth Plus Fixed Pricing Direct",15661,null,null,null,null,null,null,null,null,null,null,null,null,{"$f":"IFERROR(VLOOKUP(ROWS($AE$2:AE585),P585:Q1333,2,0),\"\")","v":""},null,null,null,null,{"$f":"IFERROR(VLOOKUP(ROWS(AJ$2:$AJ585),O585:Q1333,3,0),\"\")","v":""},null,{"$f":"IFERROR(VLOOKUP(ROWS(AL$2:$AL585),N585:Q1333,4,0),\"\")","v":""}]
[null,null,null,null,null,null,null,null,null,null,null,null,null,0,0,0,"Sahara Wealth Plus Variable Pricing",2877,null,null,null,null,null,null,null,null,null,null,null,null,{"$f":"IFERROR(VLOOKUP(ROWS($AE$2:AE586),P586:Q1334,2,0),\"\")","v":""},null,null,null,null,{"$f":"IFERROR(VLOOKUP(ROWS(AJ$2:$AJ586),O586:Q1334,3,0),\"\")","v":""},null,{"$f":"IFERROR(VLOOKUP(ROWS(AL$2:$AL586),N586:Q1334,4,0),\"\")","v":""}]
[null,null,null,null,null,null,null,null,null,null,null,null,null,0,0,0,"Sahara Wealth Plus Variable Pricing Direct",15663,null,null,null,null,null,null,null,null,null,null,null,null,{"$f":"IFERROR(VLOOKUP(ROWS($AE$2:AE587),P587:Q1335,2,0),\"\")","v":""},null,null,null,null,{"$f":"IFERROR(VLOOKUP(ROWS(AJ$2:$AJ587),O587:Q1335,3,0),\"\")","v":""},null,{"$f":"IFERROR(VLOOKUP(ROWS(AL$2:$AL587),N587:Q1335,4,0),\"\")","v":""}]
[null,null,null,null,null,null,null,null,null,null,null,null,null,0,0,0,"SBI Bluechip",3083,null,null,null,null,null,null,null,null,null,null,null,null,{"$f":"IFERROR(VLOOKUP(ROWS($AE$2:AE588),P588:Q1336,2,0),\"\")","v":""},null,null,null,null,{"$f":"IFERROR(VLOOKUP(ROWS(AJ$2:$AJ588),O588:Q1336,3,0),\"\")","v":""},null,{"$f":"IFERROR(VLOOKUP(ROWS(AL$2:$AL588),N588:Q1336,4,0),\"\")","v":""}]
[null,null,null,null,null,null,null,null,null,null,null,null,null,0,0,0,"SBI Bluechip Direct",16198,null,null,null,null,null,null,null,null,null,null,null,null,{"$f":"IFERROR(VLOOKUP(ROWS($AE$2:AE589),P589:Q1337,2,0),\"\")","v":""},null,null,null,null,{"$f":"IFERROR(VLOOKUP(ROWS(AJ$2:$AJ589),O589:Q1337,3,0),\"\")","v":""},null,{"$f":"IFERROR(VLOOKUP(ROWS(AL$2:$AL589),N589:Q1337,4,0),\"\")","v":""}]
[null,null,null,null,null,null,null,null,null,null,null,null,null,0,0,0,"SBI Contra",633,null,null,null,null,null,null,null,null,null,null,null,null,{"$f":"IFERROR(VLOOKUP(ROWS($AE$2:AE590),P590:Q1338,2,0),\"\")","v":""},null,null,null,null,{"$f":"IFERROR(VLOOKUP(ROWS(AJ$2:$AJ590),O590:Q1338,3,0),\"\")","v":""},null,{"$f":"IFERROR(VLOOKUP(ROWS(AL$2:$AL590),N590:Q1338,4,0),\"\")","v":""}]
[null,null,null,null,null,null,null,null,null,null,null,null,null,0,0,0,"SBI Contra Direct",16322,null,null,null,null,null,null,null,null,null,null,null,null,{"$f":"IFERROR(VLOOKUP(ROWS($AE$2:AE591),P591:Q1339,2,0),\"\")","v":""},null,null,null,null,{"$f":"IFERROR(VLOOKUP(ROWS(AJ$2:$AJ591),O591:Q1339,3,0),\"\")","v":""},null,{"$f":"IFERROR(VLOOKUP(ROWS(AL$2:$AL591),N591:Q1339,4,0),\"\")","v":""}]
[null,null,null,null,null,null,null,null,null,null,null,null,null,0,0,0,"SBI Emerging Businesses",2415,null,null,null,null,null,null,null,null,null,null,null,null,{"$f":"IFERROR(VLOOKUP(ROWS($AE$2:AE592),P592:Q1340,2,0),\"\")","v":""},null,null,null,null,{"$f":"IFERROR(VLOOKUP(ROWS(AJ$2:$AJ592),O592:Q1340,3,0),\"\")","v":""},null,{"$f":"IFERROR(VLOOKUP(ROWS(AL$2:$AL592),N592:Q1340,4,0),\"\")","v":""}]
[null,null,null,null,null,null,null,null,null,null,null,null,null,0,0,0,"SBI Emerging Businesses Direct",16324,null,null,null,null,null,null,null,null,null,null,null,null,{"$f":"IFERROR(VLOOKUP(ROWS($AE$2:AE593),P593:Q1341,2,0),\"\")","v":""},null,null,null,null,{"$f":"IFERROR(VLOOKUP(ROWS(AJ$2:$AJ593),O593:Q1341,3,0),\"\")","v":""},null,{"$f":"IFERROR(VLOOKUP(ROWS(AL$2:$AL593),N593:Q1341,4,0),\"\")","v":""}]
[null,null,null,null,null,null,null,null,null,null,null,null,null,0,0,0,"SBI FMCG",630,null,null,null,null,null,null,null,null,null,null,null,null,{"$f":"IFERROR(VLOOKUP(ROWS($AE$2:AE594),P594:Q1342,2,0),\"\")","v":""},null,null,null,null,{"$f":"IFERROR(VLOOKUP(ROWS(AJ$2:$AJ594),O594:Q1342,3,0),\"\")","v":""},null,{"$f":"IFERROR(VLOOKUP(ROWS(AL$2:$AL594),N594:Q1342,4,0),\"\")","v":""}]
[null,null,null,null,null,null,null,null,null,null,null,null,null,0,0,0,"SBI FMCG Direct",16881,null,null,null,null,null,null,null,null,null,null,null,null,{"$f":"IFERROR(VLOOKUP(ROWS($AE$2:AE595),P595:Q1343,2,0),\"\")","v":""},null,null,null,null,{"$f":"IFERROR(VLOOKUP(ROWS(AJ$2:$AJ595),O595:Q1343,3,0),\"\")","v":""},null,{"$f":"IFERROR(VLOOKUP(ROWS(AL$2:$AL595),N595:Q1343,4,0),\"\")","v":""}]
[null,null,null,null,null,null,null,null,null,null,null,null,null,0,0,0,"SBI Infrastructure",5071,null,null,null,null,null,null,null,null,null,null,null,null,{"$f":"IFERROR(VLOOKUP(ROWS($AE$2:AE596),P596:Q1344,2,0),\"\")","v":""},null,null,null,null,{"$f":"IFERROR(VLOOKUP(ROWS(AJ$2:$AJ596),O596:Q1344,3,0),\"\")","v":""},null,{"$f":"IFERROR(VLOOKUP(ROWS(AL$2:$AL596),N596:Q1344,4,0),\"\")","v":""}]
[null,null,null,null,null,null,null,null,null,null,null,null,null,0,0,0,"SBI Infrastructure Direct",17161,null,null,null,null,null,null,null,null,null,null,null,null,{"$f":"IFERROR(VLOOKUP(ROWS($AE$2:AE597),P597:Q1345,2,0),\"\")","v":""},null,null,null,null,{"$f":"IFERROR(VLOOKUP(ROWS(AJ$2:$AJ597),O597:Q1345,3,0),\"\")","v":""},null,{"$f":"IFERROR(VLOOKUP(ROWS(AL$2:$AL597),N597:Q1345,4,0),\"\")","v":""}]
[null,null,null,null,null,null,null,null,null,null,null,null,null,0,0,0,"SBI IT",631,null,null,null,null,null,null,null,null,null,null,null,null,{"$f":"IFERROR(VLOOKUP(ROWS($AE$2:AE598),P598:Q1346,2,0),\"\")","v":""},null,null,null,null,{"$f":"IFERROR(VLOOKUP(ROWS(AJ$2:$AJ598),O598:Q1346,3,0),\"\")","v":""},null,{"$f":"IFERROR(VLOOKUP(ROWS(AL$2:$AL598),N598:Q1346,4,0),\"\")","v":""}]
[null,null,null,null,null,null,null,null,null,null,null,null,null,0,0,0,"SBI IT Direct",16884,null,null,null,null,null,null,null,null,null,null,null,null,{"$f":"IFERROR(VLOOKUP(ROWS($AE$2:AE599),P599:Q1347,2,0),\"\")","v":""},null,null,null,null,{"$f":"IFERROR(VLOOKUP(ROWS(AJ$2:$AJ599),O599:Q1347,3,0),\"\")","v":""},null,{"$f":"IFERROR(VLOOKUP(ROWS(AL$2:$AL599),N599:Q1347,4,0),\"\")","v":""}]
[null,null,null,null,null,null,null,null,null,null,null,null,null,0,0,0,"SBI Magnum COMMA",2812,null,null,null,null,null,null,null,null,null,null,null,null,{"$f":"IFERROR(VLOOKUP(ROWS($AE$2:AE600),P600:Q1348,2,0),\"\")","v":""},null,null,null,null,{"$f":"IFERROR(VLOOKUP(ROWS(AJ$2:$AJ600),O600:Q1348,3,0),\"\")","v":""},null,{"$f":"IFERROR(VLOOKUP(ROWS(AL$2:$AL600),N600:Q1348,4,0),\"\")","v":""}]
[null,null,null,null,null,null,null,null,null,null,null,null,null,0,0,0,"SBI Magnum COMMA Direct",17523,null,null,null,null,null,null,null,null,null,null,null,null,{"$f":"IFERROR(VLOOKUP(ROWS($AE$2:AE601),P601:Q1349,2,0),\"\")","v":""},null,null,null,null,{"$f":"IFERROR(VLOOKUP(ROWS(AJ$2:$AJ601),O601:Q1349,3,0),\"\")","v":""},null,{"$f":"IFERROR(VLOOKUP(ROWS(AL$2:$AL601),N601:Q1349,4,0),\"\")","v":""}]
[null,null,null,null,null,null,null,null,null,null,null,null,null,0,0,0,"SBI Magnum Equity",190,null,null,null,null,null,null,null,null,null,null,null,null,{"$f":"IFERROR(VLOOKUP(ROWS($AE$2:AE602),P602:Q1350,2,0),\"\")","v":""},null,null,null,null,{"$f":"IFERROR(VLOOKUP(ROWS(AJ$2:$AJ602),O602:Q1350,3,0),\"\")","v":""},null,{"$f":"IFERROR(VLOOKUP(ROWS(AL$2:$AL602),N602:Q1350,4,0),\"\")","v":""}]
[null,null,null,null,null,null,null,null,null,null,null,null,null,0,0,0,"SBI Magnum Equity Direct",16219,null,null,null,null,null,null,null,null,null,null,null,null,{"$f":"IFERROR(VLOOKUP(ROWS($AE$2:AE603),P603:Q1351,2,0),\"\")","v":""},null,null,null,null,{"$f":"IFERROR(VLOOKUP(ROWS(AJ$2:$AJ603),O603:Q1351,3,0),\"\")","v":""},null,{"$f":"IFERROR(VLOOKUP(ROWS(AL$2:$AL603),N603:Q1351,4,0),\"\")","v":""}]
[null,null,null,null,null,null,null,null,null,null,null,null,null,0,0,0,"SBI Magnum Global",201,null,null,null,null,null,null,null,null,null,null,null,null,{"$f":"IFERROR(VLOOKUP(ROWS($AE$2:AE604),P604:Q1352,2,0),\"\")","v":""},null,null,null,null,{"$f":"IFERROR(VLOOKUP(ROWS(AJ$2:$AJ604),O604:Q1352,3,0),\"\")","v":""},null,{"$f":"IFERROR(VLOOKUP(ROWS(AL$2:$AL604),N604:Q1352,4,0),\"\")","v":""}]
[null,null,null,null,null,null,null,null,null,null,null,null,null,0,0,0,"SBI Magnum Global Direct",16224,null,null,null,null,null,null,null,null,null,null,null,null,{"$f":"IFERROR(VLOOKUP(ROWS($AE$2:AE605),P605:Q1353,2,0),\"\")","v":""},null,null,null,null,{"$f":"IFERROR(VLOOKUP(ROWS(AJ$2:$AJ605),O605:Q1353,3,0),\"\")","v":""},null,{"$f":"IFERROR(VLOOKUP(ROWS(AL$2:$AL605),N605:Q1353,4,0),\"\")","v":""}]
[null,null,null,null,null,null,null,null,null,null,null,null,null,0,0,0,"SBI Magnum Midcap",2662,null,null,null,null,null,null,null,null,null,null,null,null,{"$f":"IFERROR(VLOOKUP(ROWS($AE$2:AE606),P606:Q1354,2,0),\"\")","v":""},null,null,null,null,{"$f":"IFERROR(VLOOKUP(ROWS(AJ$2:$AJ606),O606:Q1354,3,0),\"\")","v":""},null,{"$f":"IFERROR(VLOOKUP(ROWS(AL$2:$AL606),N606:Q1354,4,0),\"\")","v":""}]
[null,null,null,null,null,null,null,null,null,null,null,null,null,0,0,0,"SBI Magnum Midcap Direct",16235,null,null,null,null,null,null,null,null,null,null,null,null,{"$f":"IFERROR(VLOOKUP(ROWS($AE$2:AE607),P607:Q1355,2,0),\"\")","v":""},null,null,null,null,{"$f":"IFERROR(VLOOKUP(ROWS(AJ$2:$AJ607),O607:Q1355,3,0),\"\")","v":""},null,{"$f":"IFERROR(VLOOKUP(ROWS(AL$2:$AL607),N607:Q1355,4,0),\"\")","v":""}]
[null,null,null,null,null,null,null,null,null,null,null,null,null,0,0,0,"SBI Magnum MultiCap",2859,null,null,null,null,null,null,null,null,null,null,null,null,{"$f":"IFERROR(VLOOKUP(ROWS($AE$2:AE608),P608:Q1356,2,0),\"\")","v":""},null,null,null,null,{"$f":"IFERROR(VLOOKUP(ROWS(AJ$2:$AJ608),O608:Q1356,3,0),\"\")","v":""},null,{"$f":"IFERROR(VLOOKUP(ROWS(AL$2:$AL608),N608:Q1356,4,0),\"\")","v":""}]
[null,null,null,null,null,null,null,null,null,null,null,null,null,0,0,0,"SBI Magnum MultiCap Direct",17514,null,null,null,null,null,null,null,null,null,null,null,null,{"$f":"IFERROR(VLOOKUP(ROWS($AE$2:AE609),P609:Q1357,2,0),\"\")","v":""},null,null,null,null,{"$f":"IFERROR(VLOOKUP(ROWS(AJ$2:$AJ609),O609:Q1357,3,0),\"\")","v":""},null,{"$f":"IFERROR(VLOOKUP(ROWS(AL$2:$AL609),N609:Q1357,4,0),\"\")","v":""}]
[null,null,null,null,null,null,null,null,null,null,null,null,null,0,0,0,"SBI Magnum Multiplier Plus",197,null,null,null,null,null,null,null,null,null,null,null,null,{"$f":"IFERROR(VLOOKUP(ROWS($AE$2:AE610),P610:Q1358,2,0),\"\")","v":""},null,null,null,null,{"$f":"IFERROR(VLOOKUP(ROWS(AJ$2:$AJ610),O610:Q1358,3,0),\"\")","v":""},null,{"$f":"IFERROR(VLOOKUP(ROWS(AL$2:$AL610),N610:Q1358,4,0),\"\")","v":""}]
[null,null,null,null,null,null,null,null,null,null,null,null,null,0,0,0,"SBI Magnum Multiplier Plus Direct",16240,null,null,null,null,null,null,null,null,null,null,null,null,{"$f":"IFERROR(VLOOKUP(ROWS($AE$2:AE611),P611:Q1359,2,0),\"\")","v":""},null,null,null,null,{"$f":"IFERROR(VLOOKUP(ROWS(AJ$2:$AJ611),O611:Q1359,3,0),\"\")","v":""},null,{"$f":"IFERROR(VLOOKUP(ROWS(AL$2:$AL611),N611:Q1359,4,0),\"\")","v":""}]
[null,null,null,null,null,null,null,null,null,null,null,null,null,0,0,0,"SBI Magnum Taxgain",198,null,null,null,null,null,null,null,null,null,null,null,null,{"$f":"IFERROR(VLOOKUP(ROWS($AE$2:AE612),P612:Q1360,2,0),\"\")","v":""},null,null,null,null,{"$f":"IFERROR(VLOOKUP(ROWS(AJ$2:$AJ612),O612:Q1360,3,0),\"\")","v":""},null,{"$f":"IFERROR(VLOOKUP(ROWS(AL$2:$AL612),N612:Q1360,4,0),\"\")","v":""}]
[null,null,null,null,null,null,null,null,null,null,null,null,null,0,0,0,"SBI Magnum Taxgain Direct",16244,null,null,null,null,null,null,null,null,null,null,null,null,{"$f":"IFERROR(VLOOKUP(ROWS($AE$2:AE613),P613:Q1361,2,0),\"\")","v":""},null,null,null,null,{"$f":"IFERROR(VLOOKUP(ROWS(AJ$2:$AJ613),O613:Q1361,3,0),\"\")","v":""},null,{"$f":"IFERROR(VLOOKUP(ROWS(AL$2:$AL613),N613:Q1361,4,0),\"\")","v":""}]
[null,null,null,null,null,null,null,null,null,null,null,null,null,0,0,0,"SBI Nifty Index",1164,null,null,null,null,null,null,null,null,null,null,null,null,{"$f":"IFERROR(VLOOKUP(ROWS($AE$2:AE614),P614:Q1362,2,0),\"\")","v":""},null,null,null,null,{"$f":"IFERROR(VLOOKUP(ROWS(AJ$2:$AJ614),O614:Q1362,3,0),\"\")","v":""},null,{"$f":"IFERROR(VLOOKUP(ROWS(AL$2:$AL614),N614:Q1362,4,0),\"\")","v":""}]
[null,null,null,null,null,null,null,null,null,null,null,null,null,0,0,0,"SBI Nifty Index Direct",16233,null,null,null,null,null,null,null,null,null,null,null,null,{"$f":"IFERROR(VLOOKUP(ROWS($AE$2:AE615),P615:Q1363,2,0),\"\")","v":""},null,null,null,null,{"$f":"IFERROR(VLOOKUP(ROWS(AJ$2:$AJ615),O615:Q1363,3,0),\"\")","v":""},null,{"$f":"IFERROR(VLOOKUP(ROWS(AL$2:$AL615),N615:Q1363,4,0),\"\")","v":""}]
[null,null,null,null,null,null,null,null,null,null,null,null,null,0,0,0,"SBI Pharma",632,null,null,null,null,null,null,null,null,null,null,null,null,{"$f":"IFERROR(VLOOKUP(ROWS($AE$2:AE616),P616:Q1364,2,0),\"\")","v":""},null,null,null,null,{"$f":"IFERROR(VLOOKUP(ROWS(AJ$2:$AJ616),O616:Q1364,3,0),\"\")","v":""},null,{"$f":"IFERROR(VLOOKUP(ROWS(AL$2:$AL616),N616:Q1364,4,0),\"\")","v":""}]
[null,null,null,null,null,null,null,null,null,null,null,null,null,0,0,0,"SBI Pharma Direct",16327,null,null,null,null,null,null,null,null,null,null,null,null,{"$f":"IFERROR(VLOOKUP(ROWS($AE$2:AE617),P617:Q1365,2,0),\"\")","v":""},null,null,null,null,{"$f":"IFERROR(VLOOKUP(ROWS(AJ$2:$AJ617),O617:Q1365,3,0),\"\")","v":""},null,{"$f":"IFERROR(VLOOKUP(ROWS(AL$2:$AL617),N617:Q1365,4,0),\"\")","v":""}]
[null,null,null,null,null,null,null,null,null,null,null,null,null,0,0,0,"SBI PSU",11198,null,null,null,null,null,null,null,null,null,null,null,null,{"$f":"IFERROR(VLOOKUP(ROWS($AE$2:AE618),P618:Q1366,2,0),\"\")","v":""},null,null,null,null,{"$f":"IFERROR(VLOOKUP(ROWS(AJ$2:$AJ618),O618:Q1366,3,0),\"\")","v":""},null,{"$f":"IFERROR(VLOOKUP(ROWS(AL$2:$AL618),N618:Q1366,4,0),\"\")","v":""}]
[null,null,null,null,null,null,null,null,null,null,null,null,null,0,0,0,"SBI PSU Direct",16311,null,null,null,null,null,null,null,null,null,null,null,null,{"$f":"IFERROR(VLOOKUP(ROWS($AE$2:AE619),P619:Q1367,2,0),\"\")","v":""},null,null,null,null,{"$f":"IFERROR(VLOOKUP(ROWS(AJ$2:$AJ619),O619:Q1367,3,0),\"\")","v":""},null,{"$f":"IFERROR(VLOOKUP(ROWS(AL$2:$AL619),N619:Q1367,4,0),\"\")","v":""}]
[null,null,null,null,null,null,null,null,null,null,null,null,null,0,0,0,"SBI Sensex ETF",18077,null,null,null,null,null,null,null,null,null,null,null,null,{"$f":"IFERROR(VLOOKUP(ROWS($AE$2:AE620),P620:Q1368,2,0),\"\")","v":""},null,null,null,null,{"$f":"IFERROR(VLOOKUP(ROWS(AJ$2:$AJ620),O620:Q1368,3,0),\"\")","v":""},null,{"$f":"IFERROR(VLOOKUP(ROWS(AL$2:$AL620),N620:Q1368,4,0),\"\")","v":""}]
[null,null,null,null,null,null,null,null,null,null,null,null,null,0,0,0,"Sundaram CAPEX Opp Reg Direct-G",16138,null,null,null,null,null,null,null,null,null,null,null,null,{"$f":"IFERROR(VLOOKUP(ROWS($AE$2:AE621),P621:Q1369,2,0),\"\")","v":""},null,null,null,null,{"$f":"IFERROR(VLOOKUP(ROWS(AJ$2:$AJ621),O621:Q1369,3,0),\"\")","v":""},null,{"$f":"IFERROR(VLOOKUP(ROWS(AL$2:$AL621),N621:Q1369,4,0),\"\")","v":""}]
[null,null,null,null,null,null,null,null,null,null,null,null,null,0,0,0,"Sundaram CAPEX Opp Reg-D",2833,null,null,null,null,null,null,null,null,null,null,null,null,{"$f":"IFERROR(VLOOKUP(ROWS($AE$2:AE622),P622:Q1370,2,0),\"\")","v":""},null,null,null,null,{"$f":"IFERROR(VLOOKUP(ROWS(AJ$2:$AJ622),O622:Q1370,3,0),\"\")","v":""},null,{"$f":"IFERROR(VLOOKUP(ROWS(AL$2:$AL622),N622:Q1370,4,0),\"\")","v":""}]
[null,null,null,null,null,null,null,null,null,null,null,null,null,0,0,0,"Sundaram CAPEX Opp Reg-G",2832,null,null,null,null,null,null,null,null,null,null,null,null,{"$f":"IFERROR(VLOOKUP(ROWS($AE$2:AE623),P623:Q1371,2,0),\"\")","v":""},null,null,null,null,{"$f":"IFERROR(VLOOKUP(ROWS(AJ$2:$AJ623),O623:Q1371,3,0),\"\")","v":""},null,{"$f":"IFERROR(VLOOKUP(ROWS(AL$2:$AL623),N623:Q1371,4,0),\"\")","v":""}]
[null,null,null,null,null,null,null,null,null,null,null,null,null,0,0,0,"Sundaram Energy Opportunities",6223,null,null,null,null,null,null,null,null,null,null,null,null,{"$f":"IFERROR(VLOOKUP(ROWS($AE$2:AE624),P624:Q1372,2,0),\"\")","v":""},null,null,null,null,{"$f":"IFERROR(VLOOKUP(ROWS(AJ$2:$AJ624),O624:Q1372,3,0),\"\")","v":""},null,{"$f":"IFERROR(VLOOKUP(ROWS(AL$2:$AL624),N624:Q1372,4,0),\"\")","v":""}]
[null,null,null,null,null,null,null,null,null,null,null,null,null,0,0,0,"Sundaram Energy Opportunities Direct",16142,null,null,null,null,null,null,null,null,null,null,null,null,{"$f":"IFERROR(VLOOKUP(ROWS($AE$2:AE625),P625:Q1373,2,0),\"\")","v":""},null,null,null,null,{"$f":"IFERROR(VLOOKUP(ROWS(AJ$2:$AJ625),O625:Q1373,3,0),\"\")","v":""},null,{"$f":"IFERROR(VLOOKUP(ROWS(AL$2:$AL625),N625:Q1373,4,0),\"\")","v":""}]
[null,null,null,null,null,null,null,null,null,null,null,null,null,0,0,0,"Sundaram Entertainment Opportunities Inst#",7617,null,null,null,null,null,null,null,null,null,null,null,null,{"$f":"IFERROR(VLOOKUP(ROWS($AE$2:AE626),P626:Q1374,2,0),\"\")","v":""},null,null,null,null,{"$f":"IFERROR(VLOOKUP(ROWS(AJ$2:$AJ626),O626:Q1374,3,0),\"\")","v":""},null,{"$f":"IFERROR(VLOOKUP(ROWS(AL$2:$AL626),N626:Q1374,4,0),\"\")","v":""}]
[null,null,null,null,null,null,null,null,null,null,null,null,null,0,0,0,"Sundaram Entertainment Opportunities Reg",7615,null,null,null,null,null,null,null,null,null,null,null,null,{"$f":"IFERROR(VLOOKUP(ROWS($AE$2:AE627),P627:Q1375,2,0),\"\")","v":""},null,null,null,null,{"$f":"IFERROR(VLOOKUP(ROWS(AJ$2:$AJ627),O627:Q1375,3,0),\"\")","v":""},null,{"$f":"IFERROR(VLOOKUP(ROWS(AL$2:$AL627),N627:Q1375,4,0),\"\")","v":""}]
[null,null,null,null,null,null,null,null,null,null,null,null,null,0,0,0,"Sundaram Entertainment Opportunities Reg Direct",16146,null,null,null,null,null,null,null,null,null,null,null,null,{"$f":"IFERROR(VLOOKUP(ROWS($AE$2:AE628),P628:Q1376,2,0),\"\")","v":""},null,null,null,null,{"$f":"IFERROR(VLOOKUP(ROWS(AJ$2:$AJ628),O628:Q1376,3,0),\"\")","v":""},null,{"$f":"IFERROR(VLOOKUP(ROWS(AL$2:$AL628),N628:Q1376,4,0),\"\")","v":""}]
[null,null,null,null,null,null,null,null,null,null,null,null,null,0,0,0,"Sundaram Equity Multiplier",4152,null,null,null,null,null,null,null,null,null,null,null,null,{"$f":"IFERROR(VLOOKUP(ROWS($AE$2:AE629),P629:Q1377,2,0),\"\")","v":""},null,null,null,null,{"$f":"IFERROR(VLOOKUP(ROWS(AJ$2:$AJ629),O629:Q1377,3,0),\"\")","v":""},null,{"$f":"IFERROR(VLOOKUP(ROWS(AL$2:$AL629),N629:Q1377,4,0),\"\")","v":""}]
[null,null,null,null,null,null,null,null,null,null,null,null,null,0,0,0,"Sundaram Equity Multiplier Direct",16086,null,null,null,null,null,null,null,null,null,null,null,null,{"$f":"IFERROR(VLOOKUP(ROWS($AE$2:AE630),P630:Q1378,2,0),\"\")","v":""},null,null,null,null,{"$f":"IFERROR(VLOOKUP(ROWS(AJ$2:$AJ630),O630:Q1378,3,0),\"\")","v":""},null,{"$f":"IFERROR(VLOOKUP(ROWS(AL$2:$AL630),N630:Q1378,4,0),\"\")","v":""}]
[null,null,null,null,null,null,null,null,null,null,null,null,null,0,0,0,"Sundaram Equity Plus",12708,null,null,null,null,null,null,null,null,null,null,null,null,{"$f":"IFERROR(VLOOKUP(ROWS($AE$2:AE631),P631:Q1379,2,0),\"\")","v":""},null,null,null,null,{"$f":"IFERROR(VLOOKUP(ROWS(AJ$2:$AJ631),O631:Q1379,3,0),\"\")","v":""},null,{"$f":"IFERROR(VLOOKUP(ROWS(AL$2:$AL631),N631:Q1379,4,0),\"\")","v":""}]
[null,null,null,null,null,null,null,null,null,null,null,null,null,0,0,0,"Sundaram Equity Plus Direct",16088,null,null,null,null,null,null,null,null,null,null,null,null,{"$f":"IFERROR(VLOOKUP(ROWS($AE$2:AE632),P632:Q1380,2,0),\"\")","v":""},null,null,null,null,{"$f":"IFERROR(VLOOKUP(ROWS(AJ$2:$AJ632),O632:Q1380,3,0),\"\")","v":""},null,{"$f":"IFERROR(VLOOKUP(ROWS(AL$2:$AL632),N632:Q1380,4,0),\"\")","v":""}]
[null,null,null,null,null,null,null,null,null,null,null,null,null,0,0,0,"Sundaram Equity Plus Direct",16089,null,null,null,null,null,null,null,null,null,null,null,null,{"$f":"IFERROR(VLOOKUP(ROWS($AE$2:AE633),P633:Q1381,2,0),\"\")","v":""},null,null,null,null,{"$f":"IFERROR(VLOOKUP(ROWS(AJ$2:$AJ633),O633:Q1381,3,0),\"\")","v":""},null,{"$f":"IFERROR(VLOOKUP(ROWS(AL$2:$AL633),N633:Q1381,4,0),\"\")","v":""}]
[null,null,null,null,null,null,null,null,null,null,null,null,null,0,0,0,"Sundaram Financial Services Opp Inst#",7613,null,null,null,null,null,null,null,null,null,null,null,null,{"$f":"IFERROR(VLOOKUP(ROWS($AE$2:AE634),P634:Q1382,2,0),\"\")","v":""},null,null,null,null,{"$f":"IFERROR(VLOOKUP(ROWS(AJ$2:$AJ634),O634:Q1382,3,0),\"\")","v":""},null,{"$f":"IFERROR(VLOOKUP(ROWS(AL$2:$AL634),N634:Q1382,4,0),\"\")","v":""}]
[null,null,null,null,null,null,null,null,null,null,null,null,null,0,0,0,"Sundaram Financial Services Opp Reg",7611,null,null,null,null,null,null,null,null,null,null,null,null,{"$f":"IFERROR(VLOOKUP(ROWS($AE$2:AE635),P635:Q1383,2,0),\"\")","v":""},null,null,null,null,{"$f":"IFERROR(VLOOKUP(ROWS(AJ$2:$AJ635),O635:Q1383,3,0),\"\")","v":""},null,{"$f":"IFERROR(VLOOKUP(ROWS(AL$2:$AL635),N635:Q1383,4,0),\"\")","v":""}]
[null,null,null,null,null,null,null,null,null,null,null,null,null,0,0,0,"Sundaram Financial Services Opp Reg Direct",16148,null,null,null,null,null,null,null,null,null,null,null,null,{"$f":"IFERROR(VLOOKUP(ROWS($AE$2:AE636),P636:Q1384,2,0),\"\")","v":""},null,null,null,null,{"$f":"IFERROR(VLOOKUP(ROWS(AJ$2:$AJ636),O636:Q1384,3,0),\"\")","v":""},null,{"$f":"IFERROR(VLOOKUP(ROWS(AL$2:$AL636),N636:Q1384,4,0),\"\")","v":""}]
[null,null,null,null,null,null,null,null,null,null,null,null,null,0,0,0,"Sundaram Global Advantage",5449,null,null,null,null,null,null,null,null,null,null,null,null,{"$f":"IFERROR(VLOOKUP(ROWS($AE$2:AE637),P637:Q1385,2,0),\"\")","v":""},null,null,null,null,{"$f":"IFERROR(VLOOKUP(ROWS(AJ$2:$AJ637),O637:Q1385,3,0),\"\")","v":""},null,{"$f":"IFERROR(VLOOKUP(ROWS(AL$2:$AL637),N637:Q1385,4,0),\"\")","v":""}]
[null,null,null,null,null,null,null,null,null,null,null,null,null,0,0,0,"Sundaram Global Advantage Direct",17200,null,null,null,null,null,null,null,null,null,null,null,null,{"$f":"IFERROR(VLOOKUP(ROWS($AE$2:AE638),P638:Q1386,2,0),\"\")","v":""},null,null,null,null,{"$f":"IFERROR(VLOOKUP(ROWS(AJ$2:$AJ638),O638:Q1386,3,0),\"\")","v":""},null,{"$f":"IFERROR(VLOOKUP(ROWS(AL$2:$AL638),N638:Q1386,4,0),\"\")","v":""}]
[null,null,null,null,null,null,null,null,null,null,null,null,null,0,0,0,"Sundaram Growth Direct",16093,null,null,null,null,null,null,null,null,null,null,null,null,{"$f":"IFERROR(VLOOKUP(ROWS($AE$2:AE639),P639:Q1387,2,0),\"\")","v":""},null,null,null,null,{"$f":"IFERROR(VLOOKUP(ROWS(AJ$2:$AJ639),O639:Q1387,3,0),\"\")","v":""},null,{"$f":"IFERROR(VLOOKUP(ROWS(AL$2:$AL639),N639:Q1387,4,0),\"\")","v":""}]
[null,null,null,null,null,null,null,null,null,null,null,null,null,0,0,0,"Sundaram Growth Reg",411,null,null,null,null,null,null,null,null,null,null,null,null,{"$f":"IFERROR(VLOOKUP(ROWS($AE$2:AE640),P640:Q1388,2,0),\"\")","v":""},null,null,null,null,{"$f":"IFERROR(VLOOKUP(ROWS(AJ$2:$AJ640),O640:Q1388,3,0),\"\")","v":""},null,{"$f":"IFERROR(VLOOKUP(ROWS(AL$2:$AL640),N640:Q1388,4,0),\"\")","v":""}]
[null,null,null,null,null,null,null,null,null,null,null,null,null,0,0,0,"Sundaram PSU Opportunities",10803,null,null,null,null,null,null,null,null,null,null,null,null,{"$f":"IFERROR(VLOOKUP(ROWS($AE$2:AE641),P641:Q1389,2,0),\"\")","v":""},null,null,null,null,{"$f":"IFERROR(VLOOKUP(ROWS(AJ$2:$AJ641),O641:Q1389,3,0),\"\")","v":""},null,{"$f":"IFERROR(VLOOKUP(ROWS(AL$2:$AL641),N641:Q1389,4,0),\"\")","v":""}]
[null,null,null,null,null,null,null,null,null,null,null,null,null,0,0,{"$f":"IF(ISNUMBER(SEARCH($H$6,Q642)),MAX($P$1,P641)+1,0)","v":0},"Sundaram PSU Opportunities Direct",16154,null,null,null,null,null,null,null,null,null,null,null,null,{"$f":"IFERROR(VLOOKUP(ROWS($AE$2:AE642),P642:Q1390,2,0),\"\")","v":""},null,null,null,null,{"$f":"IFERROR(VLOOKUP(ROWS(AJ$2:$AJ642),O642:Q1390,3,0),\"\")","v":""},null,{"$f":"IFERROR(VLOOKUP(ROWS(AL$2:$AL642),N642:Q1390,4,0),\"\")","v":""}]
[null,null,null,null,null,null,null,null,null,null,null,null,null,{"$f":"IF(ISNUMBER(SEARCH($H$16,Q643)),MAX($N$1,N642)+1,0)","v":0},{"$f":"IF(ISNUMBER(SEARCH($H$11,Q643)),MAX($O$1,O642)+1,0)","v":0},0,"Sundaram Rural India Reg",3268,null,null,null,null,null,null,null,null,null,null,null,null,{"$f":"IFERROR(VLOOKUP(ROWS($AE$2:AE643),P643:Q1391,2,0),\"\")","v":""},null,null,null,null,{"$f":"IFERROR(VLOOKUP(ROWS(AJ$2:$AJ643),O643:Q1391,3,0),\"\")","v":""},null,{"$f":"IFERROR(VLOOKUP(ROWS(AL$2:$AL643),N643:Q1391,4,0),\"\")","v":""}]
[null,null,null,null,null,null,null,null,null,null,null,null,null,0,0,0,"Sundaram Rural India Reg Direct",16163,null,null,null,null,null,null,null,null,null,null,null,null,{"$f":"IFERROR(VLOOKUP(ROWS($AE$2:AE644),P644:Q1392,2,0),\"\")","v":""},null,null,null,null,{"$f":"IFERROR(VLOOKUP(ROWS(AJ$2:$AJ644),O644:Q1392,3,0),\"\")","v":""},null,{"$f":"IFERROR(VLOOKUP(ROWS(AL$2:$AL644),N644:Q1392,4,0),\"\")","v":""}]
[null,null,null,null,null,null,null,null,null,null,null,null,null,0,0,0,"Sundaram S.M.I.L.E. Direct",16112,null,null,null,null,null,null,null,null,null,null,null,null,{"$f":"IFERROR(VLOOKUP(ROWS($AE$2:AE645),P645:Q1393,2,0),\"\")","v":""},null,null,null,null,{"$f":"IFERROR(VLOOKUP(ROWS(AJ$2:$AJ645),O645:Q1393,3,0),\"\")","v":""},null,{"$f":"IFERROR(VLOOKUP(ROWS(AL$2:$AL645),N645:Q1393,4,0),\"\")","v":""}]
[null,null,null,null,null,null,null,null,null,null,null,null,null,0,0,0,"Sundaram S.M.I.L.E. Inst#",7691,null,null,null,null,null,null,null,null,null,null,null,null,{"$f":"IFERROR(VLOOKUP(ROWS($AE$2:AE646),P646:Q1394,2,0),\"\")","v":""},null,null,null,null,{"$f":"IFERROR(VLOOKUP(ROWS(AJ$2:$AJ646),O646:Q1394,3,0),\"\")","v":""},null,{"$f":"IFERROR(VLOOKUP(ROWS(AL$2:$AL646),N646:Q1394,4,0),\"\")","v":""}]
[null,null,null,null,null,null,null,null,null,null,null,null,null,0,0,0,"Sundaram S.M.I.L.E. Reg",2599,null,null,null,null,null,null,null,null,null,null,null,null,{"$f":"IFERROR(VLOOKUP(ROWS($AE$2:AE647),P647:Q1395,2,0),\"\")","v":""},null,null,null,null,{"$f":"IFERROR(VLOOKUP(ROWS(AJ$2:$AJ647),O647:Q1395,3,0),\"\")","v":""},null,{"$f":"IFERROR(VLOOKUP(ROWS(AL$2:$AL647),N647:Q1395,4,0),\"\")","v":""}]
[null,null,null,null,null,null,null,null,null,null,null,null,null,0,0,0,"Sundaram Select Focus Inst#",7685,null,null,null,null,null,null,null,null,null,null,null,null,{"$f":"IFERROR(VLOOKUP(ROWS($AE$2:AE648),P648:Q1396,2,0),\"\")","v":""},null,null,null,null,{"$f":"IFERROR(VLOOKUP(ROWS(AJ$2:$AJ648),O648:Q1396,3,0),\"\")","v":""},null,{"$f":"IFERROR(VLOOKUP(ROWS(AL$2:$AL648),N648:Q1396,4,0),\"\")","v":""}]
[null,null,null,null,null,null,null,null,null,null,null,null,null,0,0,0,"Sundaram Select Focus Reg",1384,null,null,null,null,null,null,null,null,null,null,null,null,{"$f":"IFERROR(VLOOKUP(ROWS($AE$2:AE649),P649:Q1397,2,0),\"\")","v":""},null,null,null,null,{"$f":"IFERROR(VLOOKUP(ROWS(AJ$2:$AJ649),O649:Q1397,3,0),\"\")","v":""},null,{"$f":"IFERROR(VLOOKUP(ROWS(AL$2:$AL649),N649:Q1397,4,0),\"\")","v":""}]
[null,null,null,null,null,null,null,null,null,null,null,null,null,0,0,0,"Sundaram Select Focus Reg Direct",16120,null,null,null,null,null,null,null,null,null,null,null,null,{"$f":"IFERROR(VLOOKUP(ROWS($AE$2:AE650),P650:Q1398,2,0),\"\")","v":""},null,null,null,null,{"$f":"IFERROR(VLOOKUP(ROWS(AJ$2:$AJ650),O650:Q1398,3,0),\"\")","v":""},null,{"$f":"IFERROR(VLOOKUP(ROWS(AL$2:$AL650),N650:Q1398,4,0),\"\")","v":""}]
[null,null,null,null,null,null,null,null,null,null,null,null,null,0,0,0,"Sundaram Select Midcap Inst#",7687,null,null,null,null,null,null,null,null,null,null,null,null,{"$f":"IFERROR(VLOOKUP(ROWS($AE$2:AE651),P651:Q1399,2,0),\"\")","v":""},null,null,null,null,{"$f":"IFERROR(VLOOKUP(ROWS(AJ$2:$AJ651),O651:Q1399,3,0),\"\")","v":""},null,{"$f":"IFERROR(VLOOKUP(ROWS(AL$2:$AL651),N651:Q1399,4,0),\"\")","v":""}]
[null,null,null,null,null,null,null,null,null,null,null,null,null,0,0,0,"Sundaram Select Midcap Reg",1386,null,null,null,null,null,null,null,null,null,null,null,null,{"$f":"IFERROR(VLOOKUP(ROWS($AE$2:AE652),P652:Q1400,2,0),\"\")","v":""},null,null,null,null,{"$f":"IFERROR(VLOOKUP(ROWS(AJ$2:$AJ652),O652:Q1400,3,0),\"\")","v":""},null,{"$f":"IFERROR(VLOOKUP(ROWS(AL$2:$AL652),N652:Q1400,4,0),\"\")","v":""}]
[null,null,null,null,null,null,null,null,null,null,null,null,null,0,0,0,"Sundaram Select Midcap Reg Direct",16125,null,null,null,null,null,null,null,null,null,null,null,null,{"$f":"IFERROR(VLOOKUP(ROWS($AE$2:AE653),P653:Q1401,2,0),\"\")","v":""},null,null,null,null,{"$f":"IFERROR(VLOOKUP(ROWS(AJ$2:$AJ653),O653:Q1401,3,0),\"\")","v":""},null,{"$f":"IFERROR(VLOOKUP(ROWS(AL$2:$AL653),N653:Q1401,4,0),\"\")","v":""}]
[null,null,null,null,null,null,null,null,null,null,null,null,null,0,0,0,"Sundaram Taxsaver",687,null,null,null,null,null,null,null,null,null,null,null,null,{"$f":"IFERROR(VLOOKUP(ROWS($AE$2:AE654),P654:Q1402,2,0),\"\")","v":""},null,null,null,null,{"$f":"IFERROR(VLOOKUP(ROWS(AJ$2:$AJ654),O654:Q1402,3,0),\"\")","v":""},null,{"$f":"IFERROR(VLOOKUP(ROWS(AL$2:$AL654),N654:Q1402,4,0),\"\")","v":""}]
[null,null,null,null,null,null,null,null,null,null,null,null,null,0,0,0,"Sundaram Taxsaver Direct",16169,null,null,null,null,null,null,null,null,null,null,null,null,{"$f":"IFERROR(VLOOKUP(ROWS($AE$2:AE655),P655:Q1403,2,0),\"\")","v":""},null,null,null,null,{"$f":"IFERROR(VLOOKUP(ROWS(AJ$2:$AJ655),O655:Q1403,3,0),\"\")","v":""},null,{"$f":"IFERROR(VLOOKUP(ROWS(AL$2:$AL655),N655:Q1403,4,0),\"\")","v":""}]
[null,null,null,null,null,null,null,null,null,null,null,null,null,0,0,0,"Tata Dividend Yield Direct",16669,null,null,null,null,null,null,null,null,null,null,null,null,{"$f":"IFERROR(VLOOKUP(ROWS($AE$2:AE656),P656:Q1404,2,0),\"\")","v":""},null,null,null,null,{"$f":"IFERROR(VLOOKUP(ROWS(AJ$2:$AJ656),O656:Q1404,3,0),\"\")","v":""},null,{"$f":"IFERROR(VLOOKUP(ROWS(AL$2:$AL656),N656:Q1404,4,0),\"\")","v":""}]
[null,null,null,null,null,null,null,null,null,null,null,null,null,0,0,0,"Tata Dividend Yield Plan A",2491,null,null,null,null,null,null,null,null,null,null,null,null,{"$f":"IFERROR(VLOOKUP(ROWS($AE$2:AE657),P657:Q1405,2,0),\"\")","v":""},null,null,null,null,{"$f":"IFERROR(VLOOKUP(ROWS(AJ$2:$AJ657),O657:Q1405,3,0),\"\")","v":""},null,{"$f":"IFERROR(VLOOKUP(ROWS(AL$2:$AL657),N657:Q1405,4,0),\"\")","v":""}]
[null,null,null,null,null,null,null,null,null,null,null,null,null,0,0,0,"Tata Equity Opportunities Direct",16679,null,null,null,null,null,null,null,null,null,null,null,null,{"$f":"IFERROR(VLOOKUP(ROWS($AE$2:AE658),P658:Q1406,2,0),\"\")","v":""},null,null,null,null,{"$f":"IFERROR(VLOOKUP(ROWS(AJ$2:$AJ658),O658:Q1406,3,0),\"\")","v":""},null,{"$f":"IFERROR(VLOOKUP(ROWS(AL$2:$AL658),N658:Q1406,4,0),\"\")","v":""}]
[null,null,null,null,null,null,null,null,null,null,null,null,null,0,0,0,"Tata Equity Opportunities Plan A",1656,null,null,null,null,null,null,null,null,null,null,null,null,{"$f":"IFERROR(VLOOKUP(ROWS($AE$2:AE659),P659:Q1407,2,0),\"\")","v":""},null,null,null,null,{"$f":"IFERROR(VLOOKUP(ROWS(AJ$2:$AJ659),O659:Q1407,3,0),\"\")","v":""},null,{"$f":"IFERROR(VLOOKUP(ROWS(AL$2:$AL659),N659:Q1407,4,0),\"\")","v":""}]
[null,null,null,null,null,null,null,null,null,null,null,null,null,0,0,0,"Tata Equity PE",2267,null,null,null,null,null,null,null,null,null,null,null,null,{"$f":"IFERROR(VLOOKUP(ROWS($AE$2:AE660),P660:Q1408,2,0),\"\")","v":""},null,null,null,null,{"$f":"IFERROR(VLOOKUP(ROWS(AJ$2:$AJ660),O660:Q1408,3,0),\"\")","v":""},null,{"$f":"IFERROR(VLOOKUP(ROWS(AL$2:$AL660),N660:Q1408,4,0),\"\")","v":""}]
[null,null,null,null,null,null,null,null,null,null,null,null,null,0,0,0,"Tata Equity PE Direct",16952,null,null,null,null,null,null,null,null,null,null,null,null,{"$f":"IFERROR(VLOOKUP(ROWS($AE$2:AE661),P661:Q1409,2,0),\"\")","v":""},null,null,null,null,{"$f":"IFERROR(VLOOKUP(ROWS(AJ$2:$AJ661),O661:Q1409,3,0),\"\")","v":""},null,{"$f":"IFERROR(VLOOKUP(ROWS(AL$2:$AL661),N661:Q1409,4,0),\"\")","v":""}]
[null,null,null,null,null,null,null,null,null,null,null,null,null,0,0,0,"Tata Ethical Direct",16683,null,null,null,null,null,null,null,null,null,null,null,null,{"$f":"IFERROR(VLOOKUP(ROWS($AE$2:AE662),P662:Q1410,2,0),\"\")","v":""},null,null,null,null,{"$f":"IFERROR(VLOOKUP(ROWS(AJ$2:$AJ662),O662:Q1410,3,0),\"\")","v":""},null,{"$f":"IFERROR(VLOOKUP(ROWS(AL$2:$AL662),N662:Q1410,4,0),\"\")","v":""}]
[null,null,null,null,null,null,null,null,null,null,null,null,null,0,0,0,"Tata Ethical Plan A",977,null,null,null,null,null,null,null,null,null,null,null,null,{"$f":"IFERROR(VLOOKUP(ROWS($AE$2:AE663),P663:Q1411,2,0),\"\")","v":""},null,null,null,null,{"$f":"IFERROR(VLOOKUP(ROWS(AJ$2:$AJ663),O663:Q1411,3,0),\"\")","v":""},null,{"$f":"IFERROR(VLOOKUP(ROWS(AL$2:$AL663),N663:Q1411,4,0),\"\")","v":""}]
[null,null,null,null,null,null,null,null,null,null,null,null,null,0,0,0,"Tata Growing Economies Infrastructure Direct",17507,null,null,null,null,null,null,null,null,null,null,null,null,{"$f":"IFERROR(VLOOKUP(ROWS($AE$2:AE664),P664:Q1412,2,0),\"\")","v":""},null,null,null,null,{"$f":"IFERROR(VLOOKUP(ROWS(AJ$2:$AJ664),O664:Q1412,3,0),\"\")","v":""},null,{"$f":"IFERROR(VLOOKUP(ROWS(AL$2:$AL664),N664:Q1412,4,0),\"\")","v":""}]
[null,null,null,null,null,null,null,null,null,null,null,null,null,0,0,0,"Tata Growing Economies Infrastructure Plan A",6929,null,null,null,null,null,null,null,null,null,null,null,null,{"$f":"IFERROR(VLOOKUP(ROWS($AE$2:AE665),P665:Q1413,2,0),\"\")","v":""},null,null,null,null,{"$f":"IFERROR(VLOOKUP(ROWS(AJ$2:$AJ665),O665:Q1413,3,0),\"\")","v":""},null,{"$f":"IFERROR(VLOOKUP(ROWS(AL$2:$AL665),N665:Q1413,4,0),\"\")","v":""}]
[null,null,null,null,null,null,null,null,null,null,null,null,null,0,0,0,"Tata Growing Economies Infrastructure Plan B",6931,null,null,null,null,null,null,null,null,null,null,null,null,{"$f":"IFERROR(VLOOKUP(ROWS($AE$2:AE666),P666:Q1414,2,0),\"\")","v":""},null,null,null,null,{"$f":"IFERROR(VLOOKUP(ROWS(AJ$2:$AJ666),O666:Q1414,3,0),\"\")","v":""},null,{"$f":"IFERROR(VLOOKUP(ROWS(AL$2:$AL666),N666:Q1414,4,0),\"\")","v":""}]
[null,null,null,null,null,null,null,null,null,null,null,null,null,0,0,0,"Tata Growing Economies Infrastructure Plan B Direct",17508,null,null,null,null,null,null,null,null,null,null,null,null,{"$f":"IFERROR(VLOOKUP(ROWS($AE$2:AE667),P667:Q1415,2,0),\"\")","v":""},null,null,null,null,{"$f":"IFERROR(VLOOKUP(ROWS(AJ$2:$AJ667),O667:Q1415,3,0),\"\")","v":""},null,{"$f":"IFERROR(VLOOKUP(ROWS(AL$2:$AL667),N667:Q1415,4,0),\"\")","v":""}]
[null,null,null,null,null,null,null,null,null,null,null,null,null,0,0,0,"Tata Index Nifty Direct",16954,null,null,null,null,null,null,null,null,null,null,null,null,{"$f":"IFERROR(VLOOKUP(ROWS($AE$2:AE668),P668:Q1416,2,0),\"\")","v":""},null,null,null,null,{"$f":"IFERROR(VLOOKUP(ROWS(AJ$2:$AJ668),O668:Q1416,3,0),\"\")","v":""},null,{"$f":"IFERROR(VLOOKUP(ROWS(AL$2:$AL668),N668:Q1416,4,0),\"\")","v":""}]
[null,null,null,null,null,null,null,null,null,null,null,null,null,0,0,0,"Tata Index Nifty Plan A",1550,null,null,null,null,null,null,null,null,null,null,null,null,{"$f":"IFERROR(VLOOKUP(ROWS($AE$2:AE669),P669:Q1417,2,0),\"\")","v":""},null,null,null,null,{"$f":"IFERROR(VLOOKUP(ROWS(AJ$2:$AJ669),O669:Q1417,3,0),\"\")","v":""},null,{"$f":"IFERROR(VLOOKUP(ROWS(AL$2:$AL669),N669:Q1417,4,0),\"\")","v":""}]
[null,null,null,null,null,null,null,null,null,null,null,null,null,0,0,0,"Tata Index Sensex B#",1553,null,null,null,null,null,null,null,null,null,null,null,null,{"$f":"IFERROR(VLOOKUP(ROWS($AE$2:AE670),P670:Q1418,2,0),\"\")","v":""},null,null,null,null,{"$f":"IFERROR(VLOOKUP(ROWS(AJ$2:$AJ670),O670:Q1418,3,0),\"\")","v":""},null,{"$f":"IFERROR(VLOOKUP(ROWS(AL$2:$AL670),N670:Q1418,4,0),\"\")","v":""}]
[null,null,null,null,null,null,null,null,null,null,null,null,null,0,0,0,"Tata Index Sensex Direct",16955,null,null,null,null,null,null,null,null,null,null,null,null,{"$f":"IFERROR(VLOOKUP(ROWS($AE$2:AE671),P671:Q1419,2,0),\"\")","v":""},null,null,null,null,{"$f":"IFERROR(VLOOKUP(ROWS(AJ$2:$AJ671),O671:Q1419,3,0),\"\")","v":""},null,{"$f":"IFERROR(VLOOKUP(ROWS(AL$2:$AL671),N671:Q1419,4,0),\"\")","v":""}]
[null,null,null,null,null,null,null,null,null,null,null,null,null,0,0,0,"Tata Index Sensex Plan A",1551,null,null,null,null,null,null,null,null,null,null,null,null,{"$f":"IFERROR(VLOOKUP(ROWS($AE$2:AE672),P672:Q1420,2,0),\"\")","v":""},null,null,null,null,{"$f":"IFERROR(VLOOKUP(ROWS(AJ$2:$AJ672),O672:Q1420,3,0),\"\")","v":""},null,{"$f":"IFERROR(VLOOKUP(ROWS(AL$2:$AL672),N672:Q1420,4,0),\"\")","v":""}]
[null,null,null,null,null,null,null,null,null,null,null,null,null,0,0,0,"Tata Indo Global Infrastructure Direct",16701,null,null,null,null,null,null,null,null,null,null,null,null,{"$f":"IFERROR(VLOOKUP(ROWS($AE$2:AE673),P673:Q1421,2,0),\"\")","v":""},null,null,null,null,{"$f":"IFERROR(VLOOKUP(ROWS(AJ$2:$AJ673),O673:Q1421,3,0),\"\")","v":""},null,{"$f":"IFERROR(VLOOKUP(ROWS(AL$2:$AL673),N673:Q1421,4,0),\"\")","v":""}]
[null,null,null,null,null,null,null,null,null,null,null,null,null,0,0,0,"Tata Indo Global Infrastructure Plan A",5769,null,null,null,null,null,null,null,null,null,null,null,null,{"$f":"IFERROR(VLOOKUP(ROWS($AE$2:AE674),P674:Q1422,2,0),\"\")","v":""},null,null,null,null,{"$f":"IFERROR(VLOOKUP(ROWS(AJ$2:$AJ674),O674:Q1422,3,0),\"\")","v":""},null,{"$f":"IFERROR(VLOOKUP(ROWS(AL$2:$AL674),N674:Q1422,4,0),\"\")","v":""}]
[null,null,null,null,null,null,null,null,null,null,null,null,null,0,0,0,"Tata Infrastructure Direct",16703,null,null,null,null,null,null,null,null,null,null,null,null,{"$f":"IFERROR(VLOOKUP(ROWS($AE$2:AE675),P675:Q1423,2,0),\"\")","v":""},null,null,null,null,{"$f":"IFERROR(VLOOKUP(ROWS(AJ$2:$AJ675),O675:Q1423,3,0),\"\")","v":""},null,{"$f":"IFERROR(VLOOKUP(ROWS(AL$2:$AL675),N675:Q1423,4,0),\"\")","v":""}]
[null,null,null,null,null,null,null,null,null,null,null,null,null,0,0,0,"Tata Infrastructure Plan A",2543,null,null,null,null,null,null,null,null,null,null,null,null,{"$f":"IFERROR(VLOOKUP(ROWS($AE$2:AE676),P676:Q1424,2,0),\"\")","v":""},null,null,null,null,{"$f":"IFERROR(VLOOKUP(ROWS(AJ$2:$AJ676),O676:Q1424,3,0),\"\")","v":""},null,{"$f":"IFERROR(VLOOKUP(ROWS(AL$2:$AL676),N676:Q1424,4,0),\"\")","v":""}]
[null,null,null,null,null,null,null,null,null,null,null,null,null,0,0,0,"Tata Midcap Growth Direct",16717,null,null,null,null,null,null,null,null,null,null,null,null,{"$f":"IFERROR(VLOOKUP(ROWS($AE$2:AE677),P677:Q1425,2,0),\"\")","v":""},null,null,null,null,{"$f":"IFERROR(VLOOKUP(ROWS(AJ$2:$AJ677),O677:Q1425,3,0),\"\")","v":""},null,{"$f":"IFERROR(VLOOKUP(ROWS(AL$2:$AL677),N677:Q1425,4,0),\"\")","v":""}]
[null,null,null,null,null,null,null,null,null,null,null,null,null,0,0,0,"Tata Midcap Growth Plan A",103,null,null,null,null,null,null,null,null,null,null,null,null,{"$f":"IFERROR(VLOOKUP(ROWS($AE$2:AE678),P678:Q1426,2,0),\"\")","v":""},null,null,null,null,{"$f":"IFERROR(VLOOKUP(ROWS(AJ$2:$AJ678),O678:Q1426,3,0),\"\")","v":""},null,{"$f":"IFERROR(VLOOKUP(ROWS(AL$2:$AL678),N678:Q1426,4,0),\"\")","v":""}]
[null,null,null,null,null,null,null,null,null,null,null,null,null,0,0,0,"Tata Pure Equity Direct",16729,null,null,null,null,null,null,null,null,null,null,null,null,{"$f":"IFERROR(VLOOKUP(ROWS($AE$2:AE679),P679:Q1427,2,0),\"\")","v":""},null,null,null,null,{"$f":"IFERROR(VLOOKUP(ROWS(AJ$2:$AJ679),O679:Q1427,3,0),\"\")","v":""},null,{"$f":"IFERROR(VLOOKUP(ROWS(AL$2:$AL679),N679:Q1427,4,0),\"\")","v":""}]
[null,null,null,null,null,null,null,null,null,null,null,null,null,0,0,0,"Tata Pure Equity Plan A",509,null,null,null,null,null,null,null,null,null,null,null,null,{"$f":"IFERROR(VLOOKUP(ROWS($AE$2:AE680),P680:Q1428,2,0),\"\")","v":""},null,null,null,null,{"$f":"IFERROR(VLOOKUP(ROWS(AJ$2:$AJ680),O680:Q1428,3,0),\"\")","v":""},null,{"$f":"IFERROR(VLOOKUP(ROWS(AL$2:$AL680),N680:Q1428,4,0),\"\")","v":""}]
[null,null,null,null,null,null,null,null,null,null,null,null,null,0,0,0,"Tata Retirement Savings Progressive Direct",17020,null,null,null,null,null,null,null,null,null,null,null,null,{"$f":"IFERROR(VLOOKUP(ROWS($AE$2:AE681),P681:Q1429,2,0),\"\")","v":""},null,null,null,null,{"$f":"IFERROR(VLOOKUP(ROWS(AJ$2:$AJ681),O681:Q1429,3,0),\"\")","v":""},null,{"$f":"IFERROR(VLOOKUP(ROWS(AL$2:$AL681),N681:Q1429,4,0),\"\")","v":""}]
[null,null,null,null,null,null,null,null,null,null,null,null,null,0,0,0,"Tata Retirement Savings Progressive Plan A",13413,null,null,null,null,null,null,null,null,null,null,null,null,{"$f":"IFERROR(VLOOKUP(ROWS($AE$2:AE682),P682:Q1430,2,0),\"\")","v":""},null,null,null,null,{"$f":"IFERROR(VLOOKUP(ROWS(AJ$2:$AJ682),O682:Q1430,3,0),\"\")","v":""},null,{"$f":"IFERROR(VLOOKUP(ROWS(AL$2:$AL682),N682:Q1430,4,0),\"\")","v":""}]
[null,null,null,null,null,null,null,null,null,null,null,null,null,0,0,0,"Tata Tax Saving",212,null,null,null,null,null,null,null,null,null,null,null,null,{"$f":"IFERROR(VLOOKUP(ROWS($AE$2:AE683),P683:Q1431,2,0),\"\")","v":""},null,null,null,null,{"$f":"IFERROR(VLOOKUP(ROWS(AJ$2:$AJ683),O683:Q1431,3,0),\"\")","v":""},null,{"$f":"IFERROR(VLOOKUP(ROWS(AL$2:$AL683),N683:Q1431,4,0),\"\")","v":""}]
[null,null,null,null,null,null,null,null,null,null,null,null,null,0,0,0,"Tata Tax Saving Direct",16739,null,null,null,null,null,null,null,null,null,null,null,null,{"$f":"IFERROR(VLOOKUP(ROWS($AE$2:AE684),P684:Q1432,2,0),\"\")","v":""},null,null,null,null,{"$f":"IFERROR(VLOOKUP(ROWS(AJ$2:$AJ684),O684:Q1432,3,0),\"\")","v":""},null,{"$f":"IFERROR(VLOOKUP(ROWS(AL$2:$AL684),N684:Q1432,4,0),\"\")","v":""}]
[null,null,null,null,null,null,null,null,null,null,null,null,null,0,0,0,"Taurus Banking & Financial Services",14718,null,null,null,null,null,null,null,null,null,null,null,null,{"$f":"IFERROR(VLOOKUP(ROWS($AE$2:AE685),P685:Q1433,2,0),\"\")","v":""},null,null,null,null,{"$f":"IFERROR(VLOOKUP(ROWS(AJ$2:$AJ685),O685:Q1433,3,0),\"\")","v":""},null,{"$f":"IFERROR(VLOOKUP(ROWS(AL$2:$AL685),N685:Q1433,4,0),\"\")","v":""}]
[null,null,null,null,null,null,null,null,null,null,null,null,null,0,0,0,"Taurus Banking & Financial Services Direct",17023,null,null,null,null,null,null,null,null,null,null,null,null,{"$f":"IFERROR(VLOOKUP(ROWS($AE$2:AE686),P686:Q1434,2,0),\"\")","v":""},null,null,null,null,{"$f":"IFERROR(VLOOKUP(ROWS(AJ$2:$AJ686),O686:Q1434,3,0),\"\")","v":""},null,{"$f":"IFERROR(VLOOKUP(ROWS(AL$2:$AL686),N686:Q1434,4,0),\"\")","v":""}]
[null,null,null,null,null,null,null,null,null,null,null,null,null,0,0,0,"Taurus Bonanza",43,null,null,null,null,null,null,null,null,null,null,null,null,{"$f":"IFERROR(VLOOKUP(ROWS($AE$2:AE687),P687:Q1435,2,0),\"\")","v":""},null,null,null,null,{"$f":"IFERROR(VLOOKUP(ROWS(AJ$2:$AJ687),O687:Q1435,3,0),\"\")","v":""},null,{"$f":"IFERROR(VLOOKUP(ROWS(AL$2:$AL687),N687:Q1435,4,0),\"\")","v":""}]
[null,null,null,null,null,null,null,null,null,null,null,null,null,0,0,0,"Taurus Bonanza Direct",17027,null,null,null,null,null,null,null,null,null,null,null,null,{"$f":"IFERROR(VLOOKUP(ROWS($AE$2:AE688),P688:Q1436,2,0),\"\")","v":""},null,null,null,null,{"$f":"IFERROR(VLOOKUP(ROWS(AJ$2:$AJ688),O688:Q1436,3,0),\"\")","v":""},null,{"$f":"IFERROR(VLOOKUP(ROWS(AL$2:$AL688),N688:Q1436,4,0),\"\")","v":""}]
[null,null,null,null,null,null,null,null,null,null,null,null,null,0,0,0,"Taurus Discovery",215,null,null,null,null,null,null,null,null,null,null,null,null,{"$f":"IFERROR(VLOOKUP(ROWS($AE$2:AE689),P689:Q1437,2,0),\"\")","v":""},null,null,null,null,{"$f":"IFERROR(VLOOKUP(ROWS(AJ$2:$AJ689),O689:Q1437,3,0),\"\")","v":""},null,{"$f":"IFERROR(VLOOKUP(ROWS(AL$2:$AL689),N689:Q1437,4,0),\"\")","v":""}]
[null,null,null,null,null,null,null,null,null,null,null,null,null,0,0,0,"Taurus Discovery Direct",16656,null,null,null,null,null,null,null,null,null,null,null,null,{"$f":"IFERROR(VLOOKUP(ROWS($AE$2:AE690),P690:Q1438,2,0),\"\")","v":""},null,null,null,null,{"$f":"IFERROR(VLOOKUP(ROWS(AJ$2:$AJ690),O690:Q1438,3,0),\"\")","v":""},null,{"$f":"IFERROR(VLOOKUP(ROWS(AL$2:$AL690),N690:Q1438,4,0),\"\")","v":""}]
[null,null,null,null,null,null,null,null,null,null,null,null,null,0,0,0,"Taurus Ethical",10244,null,null,null,null,null,null,null,null,null,null,null,null,{"$f":"IFERROR(VLOOKUP(ROWS($AE$2:AE691),P691:Q1439,2,0),\"\")","v":""},null,null,null,null,{"$f":"IFERROR(VLOOKUP(ROWS(AJ$2:$AJ691),O691:Q1439,3,0),\"\")","v":""},null,{"$f":"IFERROR(VLOOKUP(ROWS(AL$2:$AL691),N691:Q1439,4,0),\"\")","v":""}]
[null,null,null,null,null,null,null,null,null,null,null,null,null,0,0,0,"Taurus Ethical Direct",16658,null,null,null,null,null,null,null,null,null,null,null,null,{"$f":"IFERROR(VLOOKUP(ROWS($AE$2:AE692),P692:Q1440,2,0),\"\")","v":""},null,null,null,null,{"$f":"IFERROR(VLOOKUP(ROWS(AJ$2:$AJ692),O692:Q1440,3,0),\"\")","v":""},null,{"$f":"IFERROR(VLOOKUP(ROWS(AL$2:$AL692),N692:Q1440,4,0),\"\")","v":""}]
[null,null,null,null,null,null,null,null,null,null,null,null,null,0,0,0,"Taurus Infrastructure",4256,null,null,null,null,null,null,null,null,null,null,null,null,{"$f":"IFERROR(VLOOKUP(ROWS($AE$2:AE693),P693:Q1441,2,0),\"\")","v":""},null,null,null,null,{"$f":"IFERROR(VLOOKUP(ROWS(AJ$2:$AJ693),O693:Q1441,3,0),\"\")","v":""},null,{"$f":"IFERROR(VLOOKUP(ROWS(AL$2:$AL693),N693:Q1441,4,0),\"\")","v":""}]
[null,null,null,null,null,null,null,null,null,null,null,null,null,0,0,0,"Taurus Infrastructure Direct",16672,null,null,null,null,null,null,null,null,null,null,null,null,{"$f":"IFERROR(VLOOKUP(ROWS($AE$2:AE694),P694:Q1442,2,0),\"\")","v":""},null,null,null,null,{"$f":"IFERROR(VLOOKUP(ROWS(AJ$2:$AJ694),O694:Q1442,3,0),\"\")","v":""},null,{"$f":"IFERROR(VLOOKUP(ROWS(AL$2:$AL694),N694:Q1442,4,0),\"\")","v":""}]
[null,null,null,null,null,null,null,null,null,null,null,null,null,0,0,0,"Taurus Nifty Index",11215,null,null,null,null,null,null,null,null,null,null,null,null,{"$f":"IFERROR(VLOOKUP(ROWS($AE$2:AE695),P695:Q1443,2,0),\"\")","v":""},null,null,null,null,{"$f":"IFERROR(VLOOKUP(ROWS(AJ$2:$AJ695),O695:Q1443,3,0),\"\")","v":""},null,{"$f":"IFERROR(VLOOKUP(ROWS(AL$2:$AL695),N695:Q1443,4,0),\"\")","v":""}]
[null,null,null,null,null,null,null,null,null,null,null,null,null,0,0,0,"Taurus Nifty Index Direct",17039,null,null,null,null,null,null,null,null,null,null,null,null,{"$f":"IFERROR(VLOOKUP(ROWS($AE$2:AE696),P696:Q1444,2,0),\"\")","v":""},null,null,null,null,{"$f":"IFERROR(VLOOKUP(ROWS(AJ$2:$AJ696),O696:Q1444,3,0),\"\")","v":""},null,{"$f":"IFERROR(VLOOKUP(ROWS(AL$2:$AL696),N696:Q1444,4,0),\"\")","v":""}]
[null,null,null,null,null,null,null,null,null,null,null,null,null,0,0,0,"Taurus Starshare",214,null,null,null,null,null,null,null,null,null,null,null,null,{"$f":"IFERROR(VLOOKUP(ROWS($AE$2:AE697),P697:Q1445,2,0),\"\")","v":""},null,null,null,null,{"$f":"IFERROR(VLOOKUP(ROWS(AJ$2:$AJ697),O697:Q1445,3,0),\"\")","v":""},null,{"$f":"IFERROR(VLOOKUP(ROWS(AL$2:$AL697),N697:Q1445,4,0),\"\")","v":""}]
[null,null,null,null,null,null,null,null,null,null,null,null,null,0,0,0,"Taurus Starshare Direct",16705,null,null,null,null,null,null,null,null,null,null,null,null,{"$f":"IFERROR(VLOOKUP(ROWS($AE$2:AE698),P698:Q1446,2,0),\"\")","v":""},null,null,null,null,{"$f":"IFERROR(VLOOKUP(ROWS(AJ$2:$AJ698),O698:Q1446,3,0),\"\")","v":""},null,{"$f":"IFERROR(VLOOKUP(ROWS(AL$2:$AL698),N698:Q1446,4,0),\"\")","v":""}]
[null,null,null,null,null,null,null,null,null,null,null,null,null,0,0,0,"Taurus Tax Shield",83,null,null,null,null,null,null,null,null,null,null,null,null,{"$f":"IFERROR(VLOOKUP(ROWS($AE$2:AE699),P699:Q1447,2,0),\"\")","v":""},null,null,null,null,{"$f":"IFERROR(VLOOKUP(ROWS(AJ$2:$AJ699),O699:Q1447,3,0),\"\")","v":""},null,{"$f":"IFERROR(VLOOKUP(ROWS(AL$2:$AL699),N699:Q1447,4,0),\"\")","v":""}]
[null,null,null,null,null,null,null,null,null,null,null,null,null,0,0,0,"Taurus Tax Shield Direct",16713,null,null,null,null,null,null,null,null,null,null,null,null,{"$f":"IFERROR(VLOOKUP(ROWS($AE$2:AE700),P700:Q1448,2,0),\"\")","v":""},null,null,null,null,{"$f":"IFERROR(VLOOKUP(ROWS(AJ$2:$AJ700),O700:Q1448,3,0),\"\")","v":""},null,{"$f":"IFERROR(VLOOKUP(ROWS(AL$2:$AL700),N700:Q1448,4,0),\"\")","v":""}]
[null,null,null,null,null,null,null,null,null,null,null,null,null,0,0,0,"Templeton India Equity Income",3280,null,null,null,null,null,null,null,null,null,null,null,null,{"$f":"IFERROR(VLOOKUP(ROWS($AE$2:AE701),P701:Q1449,2,0),\"\")","v":""},null,null,null,null,{"$f":"IFERROR(VLOOKUP(ROWS(AJ$2:$AJ701),O701:Q1449,3,0),\"\")","v":""},null,{"$f":"IFERROR(VLOOKUP(ROWS(AL$2:$AL701),N701:Q1449,4,0),\"\")","v":""}]
[null,null,null,null,null,null,null,null,null,null,null,null,null,0,0,0,"Templeton India Equity Income Direct",16782,null,null,null,null,null,null,null,null,null,null,null,null,{"$f":"IFERROR(VLOOKUP(ROWS($AE$2:AE702),P702:Q1450,2,0),\"\")","v":""},null,null,null,null,{"$f":"IFERROR(VLOOKUP(ROWS(AJ$2:$AJ702),O702:Q1450,3,0),\"\")","v":""},null,{"$f":"IFERROR(VLOOKUP(ROWS(AL$2:$AL702),N702:Q1450,4,0),\"\")","v":""}]
[null,null,null,null,null,null,null,null,null,null,null,null,null,0,0,0,"Templeton India Growth",221,null,null,null,null,null,null,null,null,null,null,null,null,{"$f":"IFERROR(VLOOKUP(ROWS($AE$2:AE703),P703:Q1451,2,0),\"\")","v":""},null,null,null,null,{"$f":"IFERROR(VLOOKUP(ROWS(AJ$2:$AJ703),O703:Q1451,3,0),\"\")","v":""},null,{"$f":"IFERROR(VLOOKUP(ROWS(AL$2:$AL703),N703:Q1451,4,0),\"\")","v":""}]
[null,null,null,null,null,null,null,null,null,null,null,null,null,0,0,0,"Templeton India Growth Direct",16824,null,null,null,null,null,null,null,null,null,null,null,null,{"$f":"IFERROR(VLOOKUP(ROWS($AE$2:AE704),P704:Q1452,2,0),\"\")","v":""},null,null,null,null,{"$f":"IFERROR(VLOOKUP(ROWS(AJ$2:$AJ704),O704:Q1452,3,0),\"\")","v":""},null,{"$f":"IFERROR(VLOOKUP(ROWS(AL$2:$AL704),N704:Q1452,4,0),\"\")","v":""}]
[null,null,null,null,null,null,null,null,null,null,null,null,null,0,0,0,"Union KBC Equity",12817,null,null,null,null,null,null,null,null,null,null,null,null,{"$f":"IFERROR(VLOOKUP(ROWS($AE$2:AE705),P705:Q1453,2,0),\"\")","v":""},null,null,null,null,{"$f":"IFERROR(VLOOKUP(ROWS(AJ$2:$AJ705),O705:Q1453,3,0),\"\")","v":""},null,{"$f":"IFERROR(VLOOKUP(ROWS(AL$2:$AL705),N705:Q1453,4,0),\"\")","v":""}]
[null,null,null,null,null,null,null,null,null,null,null,null,null,0,0,{"$f":"IF(ISNUMBER(SEARCH($H$6,Q706)),MAX($P$1,P705)+1,0)","v":0},"Union KBC Equity Direct",16412,null,null,null,null,null,null,null,null,null,null,null,null,{"$f":"IFERROR(VLOOKUP(ROWS($AE$2:AE706),P706:Q1454,2,0),\"\")","v":""},null,null,null,null,{"$f":"IFERROR(VLOOKUP(ROWS(AJ$2:$AJ706),O706:Q1454,3,0),\"\")","v":""},null,{"$f":"IFERROR(VLOOKUP(ROWS(AL$2:$AL706),N706:Q1454,4,0),\"\")","v":""}]
[null,null,null,null,null,null,null,null,null,null,null,null,null,{"$f":"IF(ISNUMBER(SEARCH($H$16,Q707)),MAX($N$1,N706)+1,0)","v":0},{"$f":"IF(ISNUMBER(SEARCH($H$11,Q707)),MAX($O$1,O706)+1,0)","v":0},0,"Union KBC Tax Saver",13521,null,null,null,null,null,null,null,null,null,null,null,null,{"$f":"IFERROR(VLOOKUP(ROWS($AE$2:AE707),P707:Q1455,2,0),\"\")","v":""},null,null,null,null,{"$f":"IFERROR(VLOOKUP(ROWS(AJ$2:$AJ707),O707:Q1455,3,0),\"\")","v":""},null,{"$f":"IFERROR(VLOOKUP(ROWS(AL$2:$AL707),N707:Q1455,4,0),\"\")","v":""}]
[null,null,null,null,null,null,null,null,null,null,null,null,null,0,0,0,"Union KBC Tax Saver Direct",16436,null,null,null,null,null,null,null,null,null,null,null,null,{"$f":"IFERROR(VLOOKUP(ROWS($AE$2:AE708),P708:Q1456,2,0),\"\")","v":""},null,null,null,null,{"$f":"IFERROR(VLOOKUP(ROWS(AJ$2:$AJ708),O708:Q1456,3,0),\"\")","v":""},null,{"$f":"IFERROR(VLOOKUP(ROWS(AL$2:$AL708),N708:Q1456,4,0),\"\")","v":""}]
[null,null,null,null,null,null,null,null,null,null,null,null,null,0,0,0,"UTI Banking Sector Direct",15967,null,null,null,null,null,null,null,null,null,null,null,null,{"$f":"IFERROR(VLOOKUP(ROWS($AE$2:AE709),P709:Q1457,2,0),\"\")","v":""},null,null,null,null,{"$f":"IFERROR(VLOOKUP(ROWS(AJ$2:$AJ709),O709:Q1457,3,0),\"\")","v":""},null,{"$f":"IFERROR(VLOOKUP(ROWS(AL$2:$AL709),N709:Q1457,4,0),\"\")","v":""}]
[null,null,null,null,null,null,null,null,null,null,null,null,null,0,0,0,"UTI Banking Sector Reg",2144,null,null,null,null,null,null,null,null,null,null,null,null,{"$f":"IFERROR(VLOOKUP(ROWS($AE$2:AE710),P710:Q1458,2,0),\"\")","v":""},null,null,null,null,{"$f":"IFERROR(VLOOKUP(ROWS(AJ$2:$AJ710),O710:Q1458,3,0),\"\")","v":""},null,{"$f":"IFERROR(VLOOKUP(ROWS(AL$2:$AL710),N710:Q1458,4,0),\"\")","v":""}]
[null,null,null,null,null,null,null,null,null,null,null,null,null,0,0,0,"UTI Contra",3226,null,null,null,null,null,null,null,null,null,null,null,null,{"$f":"IFERROR(VLOOKUP(ROWS($AE$2:AE711),P711:Q1459,2,0),\"\")","v":""},null,null,null,null,{"$f":"IFERROR(VLOOKUP(ROWS(AJ$2:$AJ711),O711:Q1459,3,0),\"\")","v":""},null,{"$f":"IFERROR(VLOOKUP(ROWS(AL$2:$AL711),N711:Q1459,4,0),\"\")","v":""}]
[null,null,null,null,null,null,null,null,null,null,null,null,null,0,0,0,"UTI Contra Direct",15876,null,null,null,null,null,null,null,null,null,null,null,null,{"$f":"IFERROR(VLOOKUP(ROWS($AE$2:AE712),P712:Q1460,2,0),\"\")","v":""},null,null,null,null,{"$f":"IFERROR(VLOOKUP(ROWS(AJ$2:$AJ712),O712:Q1460,3,0),\"\")","v":""},null,{"$f":"IFERROR(VLOOKUP(ROWS(AL$2:$AL712),N712:Q1460,4,0),\"\")","v":""}]
[null,null,null,null,null,null,null,null,null,null,null,null,null,0,0,0,"UTI Dividend Yield",2730,null,null,null,null,null,null,null,null,null,null,null,null,{"$f":"IFERROR(VLOOKUP(ROWS($AE$2:AE713),P713:Q1461,2,0),\"\")","v":""},null,null,null,null,{"$f":"IFERROR(VLOOKUP(ROWS(AJ$2:$AJ713),O713:Q1461,3,0),\"\")","v":""},null,{"$f":"IFERROR(VLOOKUP(ROWS(AL$2:$AL713),N713:Q1461,4,0),\"\")","v":""}]
[null,null,null,null,null,null,null,null,null,null,null,null,null,0,0,0,"UTI Dividend Yield Direct",15948,null,null,null,null,null,null,null,null,null,null,null,null,{"$f":"IFERROR(VLOOKUP(ROWS($AE$2:AE714),P714:Q1462,2,0),\"\")","v":""},null,null,null,null,{"$f":"IFERROR(VLOOKUP(ROWS(AJ$2:$AJ714),O714:Q1462,3,0),\"\")","v":""},null,{"$f":"IFERROR(VLOOKUP(ROWS(AL$2:$AL714),N714:Q1462,4,0),\"\")","v":""}]
[null,null,null,null,null,null,null,null,null,null,null,null,null,0,0,0,"UTI Energy",6726,null,null,null,null,null,null,null,null,null,null,null,null,{"$f":"IFERROR(VLOOKUP(ROWS($AE$2:AE715),P715:Q1463,2,0),\"\")","v":""},null,null,null,null,{"$f":"IFERROR(VLOOKUP(ROWS(AJ$2:$AJ715),O715:Q1463,3,0),\"\")","v":""},null,{"$f":"IFERROR(VLOOKUP(ROWS(AL$2:$AL715),N715:Q1463,4,0),\"\")","v":""}]
[null,null,null,null,null,null,null,null,null,null,null,null,null,0,0,0,"UTI Energy Direct",15887,null,null,null,null,null,null,null,null,null,null,null,null,{"$f":"IFERROR(VLOOKUP(ROWS($AE$2:AE716),P716:Q1464,2,0),\"\")","v":""},null,null,null,null,{"$f":"IFERROR(VLOOKUP(ROWS(AJ$2:$AJ716),O716:Q1464,3,0),\"\")","v":""},null,{"$f":"IFERROR(VLOOKUP(ROWS(AL$2:$AL716),N716:Q1464,4,0),\"\")","v":""}]
[null,null,null,null,null,null,null,null,null,null,null,null,null,0,0,0,"UTI Equity",247,null,null,null,null,null,null,null,null,null,null,null,null,{"$f":"IFERROR(VLOOKUP(ROWS($AE$2:AE717),P717:Q1465,2,0),\"\")","v":""},null,null,null,null,{"$f":"IFERROR(VLOOKUP(ROWS(AJ$2:$AJ717),O717:Q1465,3,0),\"\")","v":""},null,{"$f":"IFERROR(VLOOKUP(ROWS(AL$2:$AL717),N717:Q1465,4,0),\"\")","v":""}]
[null,null,null,null,null,null,null,null,null,null,null,null,null,0,0,0,"UTI Equity Direct",15714,null,null,null,null,null,null,null,null,null,null,null,null,{"$f":"IFERROR(VLOOKUP(ROWS($AE$2:AE718),P718:Q1466,2,0),\"\")","v":""},null,null,null,null,{"$f":"IFERROR(VLOOKUP(ROWS(AJ$2:$AJ718),O718:Q1466,3,0),\"\")","v":""},null,{"$f":"IFERROR(VLOOKUP(ROWS(AL$2:$AL718),N718:Q1466,4,0),\"\")","v":""}]
[null,null,null,null,null,null,null,null,null,null,null,null,null,0,0,0,"UTI Equity Tax Savings",724,null,null,null,null,null,null,null,null,null,null,null,null,{"$f":"IFERROR(VLOOKUP(ROWS($AE$2:AE719),P719:Q1467,2,0),\"\")","v":""},null,null,null,null,{"$f":"IFERROR(VLOOKUP(ROWS(AJ$2:$AJ719),O719:Q1467,3,0),\"\")","v":""},null,{"$f":"IFERROR(VLOOKUP(ROWS(AL$2:$AL719),N719:Q1467,4,0),\"\")","v":""}]
[null,null,null,null,null,null,null,null,null,null,null,null,null,0,0,0,"UTI Equity Tax Savings Direct",15723,null,null,null,null,null,null,null,null,null,null,null,null,{"$f":"IFERROR(VLOOKUP(ROWS($AE$2:AE720),P720:Q1468,2,0),\"\")","v":""},null,null,null,null,{"$f":"IFERROR(VLOOKUP(ROWS(AJ$2:$AJ720),O720:Q1468,3,0),\"\")","v":""},null,{"$f":"IFERROR(VLOOKUP(ROWS(AL$2:$AL720),N720:Q1468,4,0),\"\")","v":""}]
[null,null,null,null,null,null,null,null,null,null,null,null,null,0,0,0,"UTI India Lifestyle",5437,null,null,null,null,null,null,null,null,null,null,null,null,{"$f":"IFERROR(VLOOKUP(ROWS($AE$2:AE721),P721:Q1469,2,0),\"\")","v":""},null,null,null,null,{"$f":"IFERROR(VLOOKUP(ROWS(AJ$2:$AJ721),O721:Q1469,3,0),\"\")","v":""},null,{"$f":"IFERROR(VLOOKUP(ROWS(AL$2:$AL721),N721:Q1469,4,0),\"\")","v":""}]
[null,null,null,null,null,null,null,null,null,null,null,null,null,0,0,0,"UTI India Lifestyle Direct",15894,null,null,null,null,null,null,null,null,null,null,null,null,{"$f":"IFERROR(VLOOKUP(ROWS($AE$2:AE722),P722:Q1470,2,0),\"\")","v":""},null,null,null,null,{"$f":"IFERROR(VLOOKUP(ROWS(AJ$2:$AJ722),O722:Q1470,3,0),\"\")","v":""},null,{"$f":"IFERROR(VLOOKUP(ROWS(AL$2:$AL722),N722:Q1470,4,0),\"\")","v":""}]
[null,null,null,null,null,null,null,null,null,null,null,null,null,0,0,0,"UTI Infrastructure",2140,null,null,null,null,null,null,null,null,null,null,null,null,{"$f":"IFERROR(VLOOKUP(ROWS($AE$2:AE723),P723:Q1471,2,0),\"\")","v":""},null,null,null,null,{"$f":"IFERROR(VLOOKUP(ROWS(AJ$2:$AJ723),O723:Q1471,3,0),\"\")","v":""},null,{"$f":"IFERROR(VLOOKUP(ROWS(AL$2:$AL723),N723:Q1471,4,0),\"\")","v":""}]
[null,null,null,null,null,null,null,null,null,null,null,null,null,0,0,0,"UTI Infrastructure Direct",15900,null,null,null,null,null,null,null,null,null,null,null,null,{"$f":"IFERROR(VLOOKUP(ROWS($AE$2:AE724),P724:Q1472,2,0),\"\")","v":""},null,null,null,null,{"$f":"IFERROR(VLOOKUP(ROWS(AJ$2:$AJ724),O724:Q1472,3,0),\"\")","v":""},null,{"$f":"IFERROR(VLOOKUP(ROWS(AL$2:$AL724),N724:Q1472,4,0),\"\")","v":""}]
[null,null,null,null,null,null,null,null,null,null,null,null,null,0,0,0,"UTI Leadership Equity",3099,null,null,null,null,null,null,null,null,null,null,null,null,{"$f":"IFERROR(VLOOKUP(ROWS($AE$2:AE725),P725:Q1473,2,0),\"\")","v":""},null,null,null,null,{"$f":"IFERROR(VLOOKUP(ROWS(AJ$2:$AJ725),O725:Q1473,3,0),\"\")","v":""},null,{"$f":"IFERROR(VLOOKUP(ROWS(AL$2:$AL725),N725:Q1473,4,0),\"\")","v":""}]
[null,null,null,null,null,null,null,null,null,null,null,null,null,0,0,0,"UTI Leadership Equity Direct",15907,null,null,null,null,null,null,null,null,null,null,null,null,{"$f":"IFERROR(VLOOKUP(ROWS($AE$2:AE726),P726:Q1474,2,0),\"\")","v":""},null,null,null,null,{"$f":"IFERROR(VLOOKUP(ROWS(AJ$2:$AJ726),O726:Q1474,3,0),\"\")","v":""},null,{"$f":"IFERROR(VLOOKUP(ROWS(AL$2:$AL726),N726:Q1474,4,0),\"\")","v":""}]
[null,null,null,null,null,null,null,null,null,null,null,null,null,0,0,0,"UTI Master Plus '91",241,null,null,null,null,null,null,null,null,null,null,null,null,{"$f":"IFERROR(VLOOKUP(ROWS($AE$2:AE727),P727:Q1475,2,0),\"\")","v":""},null,null,null,null,{"$f":"IFERROR(VLOOKUP(ROWS(AJ$2:$AJ727),O727:Q1475,3,0),\"\")","v":""},null,{"$f":"IFERROR(VLOOKUP(ROWS(AL$2:$AL727),N727:Q1475,4,0),\"\")","v":""}]
[null,null,null,null,null,null,null,null,null,null,null,null,null,0,0,0,"UTI Master Plus '91 Direct",15956,null,null,null,null,null,null,null,null,null,null,null,null,{"$f":"IFERROR(VLOOKUP(ROWS($AE$2:AE728),P728:Q1476,2,0),\"\")","v":""},null,null,null,null,{"$f":"IFERROR(VLOOKUP(ROWS(AJ$2:$AJ728),O728:Q1476,3,0),\"\")","v":""},null,{"$f":"IFERROR(VLOOKUP(ROWS(AL$2:$AL728),N728:Q1476,4,0),\"\")","v":""}]
[null,null,null,null,null,null,null,null,null,null,null,null,null,0,0,0,"UTI Master Value",543,null,null,null,null,null,null,null,null,null,null,null,null,{"$f":"IFERROR(VLOOKUP(ROWS($AE$2:AE729),P729:Q1477,2,0),\"\")","v":""},null,null,null,null,{"$f":"IFERROR(VLOOKUP(ROWS(AJ$2:$AJ729),O729:Q1477,3,0),\"\")","v":""},null,{"$f":"IFERROR(VLOOKUP(ROWS(AL$2:$AL729),N729:Q1477,4,0),\"\")","v":""}]
[null,null,null,null,null,null,null,null,null,null,null,null,null,0,0,0,"UTI Master Value Direct",15799,null,null,null,null,null,null,null,null,null,null,null,null,{"$f":"IFERROR(VLOOKUP(ROWS($AE$2:AE730),P730:Q1478,2,0),\"\")","v":""},null,null,null,null,{"$f":"IFERROR(VLOOKUP(ROWS(AJ$2:$AJ730),O730:Q1478,3,0),\"\")","v":""},null,{"$f":"IFERROR(VLOOKUP(ROWS(AL$2:$AL730),N730:Q1478,4,0),\"\")","v":""}]
[null,null,null,null,null,null,null,null,null,null,null,null,null,0,0,0,"UTI Mastershare",22,null,null,null,null,null,null,null,null,null,null,null,null,{"$f":"IFERROR(VLOOKUP(ROWS($AE$2:AE731),P731:Q1479,2,0),\"\")","v":""},null,null,null,null,{"$f":"IFERROR(VLOOKUP(ROWS(AJ$2:$AJ731),O731:Q1479,3,0),\"\")","v":""},null,{"$f":"IFERROR(VLOOKUP(ROWS(AL$2:$AL731),N731:Q1479,4,0),\"\")","v":""}]
[null,null,null,null,null,null,null,null,null,null,null,null,null,0,0,0,"UTI Mastershare Direct",15789,null,null,null,null,null,null,null,null,null,null,null,null,{"$f":"IFERROR(VLOOKUP(ROWS($AE$2:AE732),P732:Q1480,2,0),\"\")","v":""},null,null,null,null,{"$f":"IFERROR(VLOOKUP(ROWS(AJ$2:$AJ732),O732:Q1480,3,0),\"\")","v":""},null,{"$f":"IFERROR(VLOOKUP(ROWS(AL$2:$AL732),N732:Q1480,4,0),\"\")","v":""}]
[null,null,null,null,null,null,null,null,null,null,null,null,null,0,0,0,"UTI Mid Cap",2138,null,null,null,null,null,null,null,null,null,null,null,null,{"$f":"IFERROR(VLOOKUP(ROWS($AE$2:AE733),P733:Q1481,2,0),\"\")","v":""},null,null,null,null,{"$f":"IFERROR(VLOOKUP(ROWS(AJ$2:$AJ733),O733:Q1481,3,0),\"\")","v":""},null,{"$f":"IFERROR(VLOOKUP(ROWS(AL$2:$AL733),N733:Q1481,4,0),\"\")","v":""}]
[null,null,null,null,null,null,null,null,null,null,null,null,null,0,0,0,"UTI Mid Cap Direct",15920,null,null,null,null,null,null,null,null,null,null,null,null,{"$f":"IFERROR(VLOOKUP(ROWS($AE$2:AE734),P734:Q1482,2,0),\"\")","v":""},null,null,null,null,{"$f":"IFERROR(VLOOKUP(ROWS(AJ$2:$AJ734),O734:Q1482,3,0),\"\")","v":""},null,{"$f":"IFERROR(VLOOKUP(ROWS(AL$2:$AL734),N734:Q1482,4,0),\"\")","v":""}]
[null,null,null,null,null,null,null,null,null,null,null,null,null,0,0,0,"UTI MNC",544,null,null,null,null,null,null,null,null,null,null,null,null,{"$f":"IFERROR(VLOOKUP(ROWS($AE$2:AE735),P735:Q1483,2,0),\"\")","v":""},null,null,null,null,{"$f":"IFERROR(VLOOKUP(ROWS(AJ$2:$AJ735),O735:Q1483,3,0),\"\")","v":""},null,{"$f":"IFERROR(VLOOKUP(ROWS(AL$2:$AL735),N735:Q1483,4,0),\"\")","v":""}]
[null,null,null,null,null,null,null,null,null,null,null,null,null,0,0,0,"UTI MNC Direct",15820,null,null,null,null,null,null,null,null,null,null,null,null,{"$f":"IFERROR(VLOOKUP(ROWS($AE$2:AE736),P736:Q1484,2,0),\"\")","v":""},null,null,null,null,{"$f":"IFERROR(VLOOKUP(ROWS(AJ$2:$AJ736),O736:Q1484,3,0),\"\")","v":""},null,{"$f":"IFERROR(VLOOKUP(ROWS(AL$2:$AL736),N736:Q1484,4,0),\"\")","v":""}]
[null,null,null,null,null,null,null,null,null,null,null,null,null,0,0,0,"UTI Nifty Index",757,null,null,null,null,null,null,null,null,null,null,null,null,{"$f":"IFERROR(VLOOKUP(ROWS($AE$2:AE737),P737:Q1485,2,0),\"\")","v":""},null,null,null,null,{"$f":"IFERROR(VLOOKUP(ROWS(AJ$2:$AJ737),O737:Q1485,3,0),\"\")","v":""},null,{"$f":"IFERROR(VLOOKUP(ROWS(AL$2:$AL737),N737:Q1485,4,0),\"\")","v":""}]
[null,null,null,null,null,null,null,null,null,null,null,null,null,0,0,0,"UTI Nifty Index Direct",15830,null,null,null,null,null,null,null,null,null,null,null,null,{"$f":"IFERROR(VLOOKUP(ROWS($AE$2:AE738),P738:Q1486,2,0),\"\")","v":""},null,null,null,null,{"$f":"IFERROR(VLOOKUP(ROWS(AJ$2:$AJ738),O738:Q1486,3,0),\"\")","v":""},null,{"$f":"IFERROR(VLOOKUP(ROWS(AL$2:$AL738),N738:Q1486,4,0),\"\")","v":""}]
[null,null,null,null,null,null,null,null,null,null,null,null,null,0,0,0,"UTI Opportunities",2820,null,null,null,null,null,null,null,null,null,null,null,null,{"$f":"IFERROR(VLOOKUP(ROWS($AE$2:AE739),P739:Q1487,2,0),\"\")","v":""},null,null,null,null,{"$f":"IFERROR(VLOOKUP(ROWS(AJ$2:$AJ739),O739:Q1487,3,0),\"\")","v":""},null,{"$f":"IFERROR(VLOOKUP(ROWS(AL$2:$AL739),N739:Q1487,4,0),\"\")","v":""}]
[null,null,null,null,null,null,null,null,null,null,null,null,null,0,0,0,"UTI Opportunities Direct",15927,null,null,null,null,null,null,null,null,null,null,null,null,{"$f":"IFERROR(VLOOKUP(ROWS($AE$2:AE740),P740:Q1488,2,0),\"\")","v":""},null,null,null,null,{"$f":"IFERROR(VLOOKUP(ROWS(AJ$2:$AJ740),O740:Q1488,3,0),\"\")","v":""},null,{"$f":"IFERROR(VLOOKUP(ROWS(AL$2:$AL740),N740:Q1488,4,0),\"\")","v":""}]
[null,null,null,null,null,null,null,null,null,null,null,null,null,0,0,0,"UTI Pharma & Healthcare",654,null,null,null,null,null,null,null,null,null,null,null,null,{"$f":"IFERROR(VLOOKUP(ROWS($AE$2:AE741),P741:Q1489,2,0),\"\")","v":""},null,null,null,null,{"$f":"IFERROR(VLOOKUP(ROWS(AJ$2:$AJ741),O741:Q1489,3,0),\"\")","v":""},null,{"$f":"IFERROR(VLOOKUP(ROWS(AL$2:$AL741),N741:Q1489,4,0),\"\")","v":""}]
[null,null,null,null,null,null,null,null,null,null,null,null,null,0,0,0,"UTI Pharma & Healthcare Direct",15932,null,null,null,null,null,null,null,null,null,null,null,null,{"$f":"IFERROR(VLOOKUP(ROWS($AE$2:AE742),P742:Q1490,2,0),\"\")","v":""},null,null,null,null,{"$f":"IFERROR(VLOOKUP(ROWS(AJ$2:$AJ742),O742:Q1490,3,0),\"\")","v":""},null,{"$f":"IFERROR(VLOOKUP(ROWS(AL$2:$AL742),N742:Q1490,4,0),\"\")","v":""}]
[null,null,null,null,null,null,null,null,null,null,null,null,null,0,0,0,"UTI Services Industries",657,null,null,null,null,null,null,null,null,null,null,null,null,{"$f":"IFERROR(VLOOKUP(ROWS($AE$2:AE743),P743:Q1491,2,0),\"\")","v":""},null,null,null,null,{"$f":"IFERROR(VLOOKUP(ROWS(AJ$2:$AJ743),O743:Q1491,3,0),\"\")","v":""},null,{"$f":"IFERROR(VLOOKUP(ROWS(AL$2:$AL743),N743:Q1491,4,0),\"\")","v":""}]
[null,null,null,null,null,null,null,null,null,null,null,null,null,0,0,0,"UTI Services Industries Direct",15939,null,null,null,null,null,null,null,null,null,null,null,null,{"$f":"IFERROR(VLOOKUP(ROWS($AE$2:AE744),P744:Q1492,2,0),\"\")","v":""},null,null,null,null,{"$f":"IFERROR(VLOOKUP(ROWS(AJ$2:$AJ744),O744:Q1492,3,0),\"\")","v":""},null,{"$f":"IFERROR(VLOOKUP(ROWS(AL$2:$AL744),N744:Q1492,4,0),\"\")","v":""}]
[null,null,null,null,null,null,null,null,null,null,null,null,null,0,0,0,"UTI Top 100",10533,null,null,null,null,null,null,null,null,null,null,null,null,{"$f":"IFERROR(VLOOKUP(ROWS($AE$2:AE745),P745:Q1493,2,0),\"\")","v":""},null,null,null,null,{"$f":"IFERROR(VLOOKUP(ROWS(AJ$2:$AJ745),O745:Q1493,3,0),\"\")","v":""},null,{"$f":"IFERROR(VLOOKUP(ROWS(AL$2:$AL745),N745:Q1493,4,0),\"\")","v":""}]
[null,null,null,null,null,null,null,null,null,null,null,null,null,0,0,0,"UTI Top 100 Direct",15845,null,null,null,null,null,null,null,null,null,null,null,null,{"$f":"IFERROR(VLOOKUP(ROWS($AE$2:AE746),P746:Q1494,2,0),\"\")","v":""},null,null,null,null,{"$f":"IFERROR(VLOOKUP(ROWS(AJ$2:$AJ746),O746:Q1494,3,0),\"\")","v":""},null,{"$f":"IFERROR(VLOOKUP(ROWS(AL$2:$AL746),N746:Q1494,4,0),\"\")","v":""}]
[null,null,null,null,null,null,null,null,null,null,null,null,null,0,0,0,"UTI Transportation and Logistics",2142,null,null,null,null,null,null,null,null,null,null,null,null,{"$f":"IFERROR(VLOOKUP(ROWS($AE$2:AE747),P747:Q1495,2,0),\"\")","v":""},null,null,null,null,{"$f":"IFERROR(VLOOKUP(ROWS(AJ$2:$AJ747),O747:Q1495,3,0),\"\")","v":""},null,{"$f":"IFERROR(VLOOKUP(ROWS(AL$2:$AL747),N747:Q1495,4,0),\"\")","v":""}]
[null,null,null,null,null,null,null,null,null,null,null,null,null,0,0,0,"UTI Transportation and Logistics Direct",15955,null,null,null,null,null,null,null,null,null,null,null,null,{"$f":"IFERROR(VLOOKUP(ROWS($AE$2:AE748),P748:Q1496,2,0),\"\")","v":""},null,null,null,null,{"$f":"IFERROR(VLOOKUP(ROWS(AJ$2:$AJ748),O748:Q1496,3,0),\"\")","v":""},null,{"$f":"IFERROR(VLOOKUP(ROWS(AL$2:$AL748),N748:Q1496,4,0),\"\")","v":""}]
[null,null,null,null,null,null,null,null,null,null,null,null,null,0,0,0,"UTI Wealth Builder Series II Direct",15963,null,null,null,null,null,null,null,null,null,null,null,null,{"$f":"IFERROR(VLOOKUP(ROWS($AE$2:AE749),P749:Q1497,2,0),\"\")","v":""},null,null,null,null,{"$f":"IFERROR(VLOOKUP(ROWS(AJ$2:$AJ749),O749:Q1497,3,0),\"\")","v":""},null,{"$f":"IFERROR(VLOOKUP(ROWS(AL$2:$AL749),N749:Q1497,4,0),\"\")","v":""}]
[null,null,null,null,null,null,null,null,null,null,null,null,null,0,0,0,"UTI Wealth Builder Series II Retail",9758]

{"sheet":"Results-simple","index":1,"n_rows":61,"n_cols":31,"rows_kept":61,"cut":false,"hidden":false,"merged":[[0,23,0,28],[23,1,24,1],[17,1,18,1],[0,16,0,20],[20,1,21,1],[13,1,14,1],[13,2,14,2],[13,3,14,3],[0,9,0,14],[17,2,18,2],[17,3,18,3]]}
[null,null,null,null,null,null,null,null,null,"mf1 vsmf2",null,null,null,null,null,null,"mf2 vsmf3",null,null,null,null,null,null,"mf1 vsmf3"]
[null,{"$f":"'mf1'!A1","v":"IDFC Premier Equity Direct"},{"$f":"'mf2'!A1","v":"Franklin India Bluechip"},{"$f":"'mf3'!A1","v":"Quantum Long Term Equity"},null,null,null,null,1,{"$f":"INDEX('mf2'!$B$27:$B$51,MATCH('mf1'!B27,'mf2'!$B$27:$B$51,0),1)","v":{"$error":"#N/A"}},{"$f":"INDEX('mf2'!$B$27:$G$51,MATCH('mf1'!B27,'mf2'!$B$27:$B$51,0),6)","v":{"$error":"#N/A"}},{"$f":"IF(ISERROR(INDEX('mf2'!$B$27:$B$51,MATCH('mf1'!B27,'mf2'!$B$27:$B$51,0),1)),0,1)","v":0},{"$f":"INDEX('mf1'!$B$27:$B$51,MATCH('mf2'!B27,'mf1'!$B$27:$B$51,0),1)","v":{"$error":"#N/A"}},{"$f":"INDEX('mf1'!$B$27:$G$51,MATCH('mf2'!B27,'mf1'!$B$27:$B$51,0),6)","v":{"$error":"#N/A"}},{"$f":"IF(ISERROR(J2),IF(ISERROR(J3),IF(ISERROR(J4),IF(ISERROR(J5),IF(ISERROR(J6),IF(ISERROR(J7),IF(ISERROR(J8),IF(ISERROR(J9),IF(ISERROR(J10),IF(ISERROR(J11),IF(ISERROR(J12),IF(ISERROR(J13),IF(ISERROR(J14),IF(ISERROR(J15),IF(ISERROR(J16),IF(ISERROR(J17),IF(ISERROR(J18),IF(ISERROR(J19),IF(ISERROR(J20),IF(ISERROR(J21),IF(ISERROR(J22),IF(ISERROR(J23),IF(ISERROR(J24),IF(ISERROR(J25),\"\",J25),J24),J23),J22),J21),J20),J19),J18),J17),J16),J15),J16),J13),J12),J11),J10),J9),J8),J7),J6),J5),J4),J3),J2)","v":"Asian Paints"},null,{"$f":"INDEX('mf3'!$B$27:$B$51,MATCH('mf2'!B27,'mf3'!$B$27:$B$51,0),1)","v":"Infosys"},{"$f":"INDEX('mf3'!$B$27:$G$51,MATCH('mf2'!B27,'mf3'!$B$27:$B$51,0),6)","v":5.05},{"$f":"IF(ISERROR(INDEX('mf3'!$B$27:$B$51,MATCH('mf2'!B27,'mf3'!$B$27:$B$51,0),1)),0,1)","v":1},{"$f":"INDEX('mf2'!$B$27:$B$51,MATCH('mf3'!B27,'mf2'!$B$27:$B$51,0),1)","v":"HDFC"},{"$f":"INDEX('mf2'!$B$27:$G$51,MATCH('mf3'!B27,'mf2'!$B$27:$B$51,0),6)","v":2.09},{"$f":"IF(ISERROR(Q2),IF(ISERROR(Q3),IF(ISERROR(Q4),IF(ISERROR(Q5),IF(ISERROR(Q6),IF(ISERROR(Q7),IF(ISERROR(Q8),IF(ISERROR(Q9),IF(ISERROR(Q10),IF(ISERROR(Q11),IF(ISERROR(Q12),IF(ISERROR(Q13),IF(ISERROR(Q14),IF(ISERROR(Q15),IF(ISERROR(Q16),IF(ISERROR(Q17),IF(ISERROR(Q18),IF(ISERROR(Q19),IF(ISERROR(Q20),IF(ISERROR(Q21),IF(ISERROR(Q22),IF(ISERROR(Q23),IF(ISERROR(Q24),IF(ISERROR(Q25),\"\",Q25),Q24),Q23),Q22),Q21),Q20),Q19),Q18),Q17),Q16),Q15),Q16),Q13),Q12),Q11),Q10),Q9),Q8),Q7),Q6),Q5),Q4),Q3),Q2)","v":"Infosys"},null,{"$f":"INDEX('mf3'!$B$27:$B$51,MATCH('mf1'!B27,'mf3'!$B$27:$B$51,0),1)","v":{"$error":"#N/A"}},{"$f":"INDEX('mf3'!$B$27:$G$51,MATCH('mf1'!B27,'mf3'!$B$27:$B$51,0),6)","v":{"$error":"#N/A"}},{"$f":"IF(ISERROR(INDEX('mf3'!$B$27:$B$51,MATCH('mf1'!B27,'mf3'!$B$27:$B$51,0),1)),0,1)","v":0},{"$f":"INDEX('mf1'!$B$27:$B$51,MATCH('mf3'!B27,'mf1'!$B$27:$B$51,0),1)","v":{"$error":"#N/A"}},{"$f":"INDEX('mf1'!$B$27:$G$51,MATCH('mf3'!B27,'mf1'!$B$27:$B$51,0),6)","v":{"$error":"#N/A"}},{"$f":"IF(ISERROR(X2),IF(ISERROR(X3),IF(ISERROR(X4),IF(ISERROR(X5),IF(ISERROR(X6),IF(ISERROR(X7),IF(ISERROR(X8),IF(ISERROR(X9),IF(ISERROR(X10),IF(ISERROR(X11),IF(ISERROR(X12),IF(ISERROR(X13),IF(ISERROR(X14),IF(ISERROR(X15),IF(ISERROR(X16),IF(ISERROR(X17),IF(ISERROR(X18),IF(ISERROR(X19),IF(ISERROR(X20),IF(ISERROR(X21),IF(ISERROR(X22),IF(ISERROR(X23),IF(ISERROR(X24),IF(ISERROR(X25),\"\",X25),X24),X23),X22),X21),X20),X19),X18),X17),X16),X15),X16),X13),X12),X11),X10),X9),X8),X7),X6),X5),X4),X3),X2)","v":"GAIL"},null,{"$f":"INDEX(mutualfund3s,MATCH(0,COUNTIF($AE$1:AE1,mutualfund3s),0))","v":"Infosys"}]
["Category:",{"$f":"'mf1'!B4","v":"Equity: Mid & Small Cap"},{"$f":"'mf2'!B4","v":"Equity: Large Cap"},{"$f":"'mf3'!B4","v":"Equity: Large & Mid Cap"},null,null,null,null,{"$f":"I2+1","v":2},{"$f":"INDEX('mf2'!$B$27:$B$51,MATCH('mf1'!B28,'mf2'!$B$27:$B$51,0),1)","v":{"$error":"#N/A"}},{"$f":"INDEX('mf2'!$B$27:$G$51,MATCH('mf1'!B28,'mf2'!$B$27:$B$51,0),6)","v":{"$error":"#N/A"}},{"$f":"IF(ISERROR(INDEX('mf2'!$B$27:$B$51,MATCH('mf1'!B28,'mf2'!$B$27:$B$51,0),1)),0,1)","v":0},{"$f":"INDEX('mf1'!$B$27:$B$51,MATCH('mf2'!B28,'mf1'!$B$27:$B$51,0),1)","v":{"$error":"#N/A"}},{"$f":"INDEX('mf1'!$B$27:$G$51,MATCH('mf2'!B28,'mf1'!$B$27:$B$51,0),6)","v":{"$error":"#N/A"}},"Asian Paints",null,{"$f":"INDEX('mf3'!$B$27:$B$51,MATCH('mf2'!B28,'mf3'!$B$27:$B$51,0),1)","v":{"$error":"#N/A"}},{"$f":"INDEX('mf3'!$B$27:$G$51,MATCH('mf2'!B28,'mf3'!$B$27:$B$51,0),6)","v":{"$error":"#N/A"}},{"$f":"IF(ISERROR(INDEX('mf3'!$B$27:$B$51,MATCH('mf2'!B28,'mf3'!$B$27:$B$51,0),1)),0,1)","v":0},{"$f":"INDEX('mf2'!$B$27:$B$51,MATCH('mf3'!B28,'mf2'!$B$27:$B$51,0),1)","v":{"$error":"#N/A"}},{"$f":"INDEX('mf2'!$B$27:$G$51,MATCH('mf3'!B28,'mf2'!$B$27:$B$51,0),6)","v":{"$error":"#N/A"}},"ONGC",null,{"$f":"INDEX('mf3'!$B$27:$B$51,MATCH('mf1'!B28,'mf3'!$B$27:$B$51,0),1)","v":{"$error":"#N/A"}},{"$f":"INDEX('mf3'!$B$27:$G$51,MATCH('mf1'!B28,'mf3'!$B$27:$B$51,0),6)","v":{"$error":"#N/A"}},{"$f":"IF(ISERROR(INDEX('mf3'!$B$27:$B$51,MATCH('mf1'!B28,'mf3'!$B$27:$B$51,0),1)),0,1)","v":0},{"$f":"INDEX('mf1'!$B$27:$B$51,MATCH('mf3'!B28,'mf1'!$B$27:$B$51,0),1)","v":{"$error":"#N/A"}},{"$f":"INDEX('mf1'!$B$27:$G$51,MATCH('mf3'!B28,'mf1'!$B$27:$B$51,0),6)","v":{"$error":"#N/A"}},{"$f":"IF(ISERROR(X3),IF(ISERROR(X4),IF(ISERROR(X5),IF(ISERROR(X6),IF(ISERROR(X7),IF(ISERROR(X8),IF(ISERROR(X9),IF(ISERROR(X10),IF(ISERROR(X11),IF(ISERROR(X12),IF(ISERROR(X13),IF(ISERROR(X14),IF(ISERROR(X15),IF(ISERROR(X16),IF(ISERROR(X17),IF(ISERROR(X18),IF(ISERROR(X19),IF(ISERROR(X20),IF(ISERROR(X21),IF(ISERROR(X22),IF(ISERROR(X23),IF(ISERROR(X24),IF(ISERROR(X25),IF(ISERROR(X26),\"\",X26),X25),X24),X23),X22),X21),X20),X19),X18),X17),X16),X17),X14),X13),X12),X11),X10),X9),X8),X7),X6),X5),X4),X3)","v":"GAIL"},null,{"$f":"INDEX(mutualfund3s,MATCH(0,COUNTIF($AE$1:AE2,mutualfund3s),0))","v":"ONGC"}]
["Net Assets:",{"$f":"'mf1'!B5","v":"R 3,448 crore (As on Dec 31, 2013)"},{"$f":"'mf2'!B5","v":"R 4,958 crore (As on Dec 31, 2013)"},{"$f":"'mf3'!B5","v":"R 201 crore (As on Dec 31, 2013)"},null,null,null,null,{"$f":"I3+1","v":3},{"$f":"INDEX('mf2'!$B$27:$B$51,MATCH('mf1'!B29,'mf2'!$B$27:$B$51,0),1)","v":{"$error":"#N/A"}},{"$f":"INDEX('mf2'!$B$27:$G$51,MATCH('mf1'!B29,'mf2'!$B$27:$B$51,0),6)","v":{"$error":"#N/A"}},{"$f":"IF(ISERROR(INDEX('mf2'!$B$27:$B$51,MATCH('mf1'!B29,'mf2'!$B$27:$B$51,0),1)),0,1)","v":0},{"$f":"INDEX('mf1'!$B$27:$B$51,MATCH('mf2'!B29,'mf1'!$B$27:$B$51,0),1)","v":{"$error":"#N/A"}},{"$f":"INDEX('mf1'!$B$27:$G$51,MATCH('mf2'!B29,'mf1'!$B$27:$B$51,0),6)","v":{"$error":"#N/A"}},"Asian Paints",null,{"$f":"INDEX('mf3'!$B$27:$B$51,MATCH('mf2'!B29,'mf3'!$B$27:$B$51,0),1)","v":{"$error":"#N/A"}},{"$f":"INDEX('mf3'!$B$27:$G$51,MATCH('mf2'!B29,'mf3'!$B$27:$B$51,0),6)","v":{"$error":"#N/A"}},{"$f":"IF(ISERROR(INDEX('mf3'!$B$27:$B$51,MATCH('mf2'!B29,'mf3'!$B$27:$B$51,0),1)),0,1)","v":0},{"$f":"INDEX('mf2'!$B$27:$B$51,MATCH('mf3'!B29,'mf2'!$B$27:$B$51,0),1)","v":"Infosys"},{"$f":"INDEX('mf2'!$B$27:$G$51,MATCH('mf3'!B29,'mf2'!$B$27:$B$51,0),6)","v":9.7899999999999991},"ONGC",null,{"$f":"INDEX('mf3'!$B$27:$B$51,MATCH('mf1'!B29,'mf3'!$B$27:$B$51,0),1)","v":{"$error":"#N/A"}},{"$f":"INDEX('mf3'!$B$27:$G$51,MATCH('mf1'!B29,'mf3'!$B$27:$B$51,0),6)","v":{"$error":"#N/A"}},{"$f":"IF(ISERROR(INDEX('mf3'!$B$27:$B$51,MATCH('mf1'!B29,'mf3'!$B$27:$B$51,0),1)),0,1)","v":0},{"$f":"INDEX('mf1'!$B$27:$B$51,MATCH('mf3'!B29,'mf1'!$B$27:$B$51,0),1)","v":{"$error":"#N/A"}},{"$f":"INDEX('mf1'!$B$27:$G$51,MATCH('mf3'!B29,'mf1'!$B$27:$B$51,0),6)","v":{"$error":"#N/A"}},"GAIL",null,{"$f":"INDEX(mutualfund3s,MATCH(0,COUNTIF($AE$1:AE3,mutualfund3s),0))","v":"NTPC"}]
["Expense:",{"$f":"'mf1'!B6","v":"1.50% (As on Sep 30, 2013)"},{"$f":"'mf2'!B6","v":"2.16% (As on Sep 30, 2013)"},{"$f":"'mf3'!B6","v":"1.25% (As on Sep 30, 2013)"},null,null,null,null,4,{"$f":"INDEX('mf2'!$B$27:$B$51,MATCH('mf1'!B30,'mf2'!$B$27:$B$51,0),1)","v":{"$error":"#N/A"}},{"$f":"INDEX('mf2'!$B$27:$G$51,MATCH('mf1'!B30,'mf2'!$B$27:$B$51,0),6)","v":{"$error":"#N/A"}},{"$f":"IF(ISERROR(INDEX('mf2'!$B$27:$B$51,MATCH('mf1'!B30,'mf2'!$B$27:$B$51,0),1)),0,1)","v":0},{"$f":"INDEX('mf1'!$B$27:$B$51,MATCH('mf2'!B30,'mf1'!$B$27:$B$51,0),1)","v":{"$error":"#N/A"}},{"$f":"INDEX('mf1'!$B$27:$G$51,MATCH('mf2'!B30,'mf1'!$B$27:$B$51,0),6)","v":{"$error":"#N/A"}},"Asian Paints",null,{"$f":"INDEX('mf3'!$B$27:$B$51,MATCH('mf2'!B30,'mf3'!$B$27:$B$51,0),1)","v":{"$error":"#N/A"}},{"$f":"INDEX('mf3'!$B$27:$G$51,MATCH('mf2'!B30,'mf3'!$B$27:$B$51,0),6)","v":{"$error":"#N/A"}},{"$f":"IF(ISERROR(INDEX('mf3'!$B$27:$B$51,MATCH('mf2'!B30,'mf3'!$B$27:$B$51,0),1)),0,1)","v":0},{"$f":"INDEX('mf2'!$B$27:$B$51,MATCH('mf3'!B30,'mf2'!$B$27:$B$51,0),1)","v":{"$error":"#N/A"}},{"$f":"INDEX('mf2'!$B$27:$G$51,MATCH('mf3'!B30,'mf2'!$B$27:$B$51,0),6)","v":{"$error":"#N/A"}},"ONGC",null,{"$f":"INDEX('mf3'!$B$27:$B$51,MATCH('mf1'!B30,'mf3'!$B$27:$B$51,0),1)","v":{"$error":"#N/A"}},{"$f":"INDEX('mf3'!$B$27:$G$51,MATCH('mf1'!B30,'mf3'!$B$27:$B$51,0),6)","v":{"$error":"#N/A"}},{"$f":"IF(ISERROR(INDEX('mf3'!$B$27:$B$51,MATCH('mf1'!B30,'mf3'!$B$27:$B$51,0),1)),0,1)","v":0},{"$f":"INDEX('mf1'!$B$27:$B$51,MATCH('mf3'!B30,'mf1'!$B$27:$B$51,0),1)","v":{"$error":"#N/A"}},{"$f":"INDEX('mf1'!$B$27:$G$51,MATCH('mf3'!B30,'mf1'!$B$27:$B$51,0),6)","v":{"$error":"#N/A"}},"GAIL",null,{"$f":"INDEX(mutualfund3s,MATCH(0,COUNTIF($AE$1:AE4,mutualfund3s),0))","v":"Larsen & Toubro"}]
[null,null,null,null,null,null,null,null,5,{"$f":"INDEX('mf2'!$B$27:$B$51,MATCH('mf1'!B31,'mf2'!$B$27:$B$51,0),1)","v":{"$error":"#N/A"}},{"$f":"INDEX('mf2'!$B$27:$G$51,MATCH('mf1'!B31,'mf2'!$B$27:$B$51,0),6)","v":{"$error":"#N/A"}},{"$f":"IF(ISERROR(INDEX('mf2'!$B$27:$B$51,MATCH('mf1'!B31,'mf2'!$B$27:$B$51,0),1)),0,1)","v":0},{"$f":"INDEX('mf1'!$B$27:$B$51,MATCH('mf2'!B31,'mf1'!$B$27:$B$51,0),1)","v":"HDFC Bank"},{"$f":"INDEX('mf1'!$B$27:$G$51,MATCH('mf2'!B31,'mf1'!$B$27:$B$51,0),6)","v":1.93},"Asian Paints",null,{"$f":"INDEX('mf3'!$B$27:$B$51,MATCH('mf2'!B31,'mf3'!$B$27:$B$51,0),1)","v":{"$error":"#N/A"}},{"$f":"INDEX('mf3'!$B$27:$G$51,MATCH('mf2'!B31,'mf3'!$B$27:$B$51,0),6)","v":{"$error":"#N/A"}},{"$f":"IF(ISERROR(INDEX('mf3'!$B$27:$B$51,MATCH('mf2'!B31,'mf3'!$B$27:$B$51,0),1)),0,1)","v":0},{"$f":"INDEX('mf2'!$B$27:$B$51,MATCH('mf3'!B31,'mf2'!$B$27:$B$51,0),1)","v":{"$error":"#N/A"}},{"$f":"INDEX('mf2'!$B$27:$G$51,MATCH('mf3'!B31,'mf2'!$B$27:$B$51,0),6)","v":{"$error":"#N/A"}},"ONGC",null,{"$f":"INDEX('mf3'!$B$27:$B$51,MATCH('mf1'!B31,'mf3'!$B$27:$B$51,0),1)","v":{"$error":"#N/A"}},{"$f":"INDEX('mf3'!$B$27:$G$51,MATCH('mf1'!B31,'mf3'!$B$27:$B$51,0),6)","v":{"$error":"#N/A"}},{"$f":"IF(ISERROR(INDEX('mf3'!$B$27:$B$51,MATCH('mf1'!B31,'mf3'!$B$27:$B$51,0),1)),0,1)","v":0},{"$f":"INDEX('mf1'!$B$27:$B$51,MATCH('mf3'!B31,'mf1'!$B$27:$B$51,0),1)","v":"Container Corp."},{"$f":"INDEX('mf1'!$B$27:$G$51,MATCH('mf3'!B31,'mf1'!$B$27:$B$51,0),6)","v":2.84},"GAIL",null,{"$f":"INDEX(mutualfund3s,MATCH(0,COUNTIF($AE$1:AE5,mutualfund3s),0))","v":"HDFC"}]
["Number of Stocks",{"$f":"'mf1'!B9","v":53},{"$f":"'mf2'!B9","v":41},{"$f":"'mf3'!B9","v":27},null,null,null,null,6,{"$f":"INDEX('mf2'!$B$27:$B$51,MATCH('mf1'!B32,'mf2'!$B$27:$B$51,0),1)","v":"Asian Paints"},{"$f":"INDEX('mf2'!$B$27:$G$51,MATCH('mf1'!B32,'mf2'!$B$27:$B$51,0),6)","v":1.52},{"$f":"IF(ISERROR(INDEX('mf2'!$B$27:$B$51,MATCH('mf1'!B32,'mf2'!$B$27:$B$51,0),1)),0,1)","v":1},{"$f":"INDEX('mf1'!$B$27:$B$51,MATCH('mf2'!B32,'mf1'!$B$27:$B$51,0),1)","v":{"$error":"#N/A"}},{"$f":"INDEX('mf1'!$B$27:$G$51,MATCH('mf2'!B32,'mf1'!$B$27:$B$51,0),6)","v":{"$error":"#N/A"}},"Asian Paints",null,{"$f":"INDEX('mf3'!$B$27:$B$51,MATCH('mf2'!B32,'mf3'!$B$27:$B$51,0),1)","v":{"$error":"#N/A"}},{"$f":"INDEX('mf3'!$B$27:$G$51,MATCH('mf2'!B32,'mf3'!$B$27:$B$51,0),6)","v":{"$error":"#N/A"}},{"$f":"IF(ISERROR(INDEX('mf3'!$B$27:$B$51,MATCH('mf2'!B32,'mf3'!$B$27:$B$51,0),1)),0,1)","v":0},{"$f":"INDEX('mf2'!$B$27:$B$51,MATCH('mf3'!B32,'mf2'!$B$27:$B$51,0),1)","v":{"$error":"#N/A"}},{"$f":"INDEX('mf2'!$B$27:$G$51,MATCH('mf3'!B32,'mf2'!$B$27:$B$51,0),6)","v":{"$error":"#N/A"}},"ONGC",null,{"$f":"INDEX('mf3'!$B$27:$B$51,MATCH('mf1'!B32,'mf3'!$B$27:$B$51,0),1)","v":{"$error":"#N/A"}},{"$f":"INDEX('mf3'!$B$27:$G$51,MATCH('mf1'!B32,'mf3'!$B$27:$B$51,0),6)","v":{"$error":"#N/A"}},{"$f":"IF(ISERROR(INDEX('mf3'!$B$27:$B$51,MATCH('mf1'!B32,'mf3'!$B$27:$B$51,0),1)),0,1)","v":0},{"$f":"INDEX('mf1'!$B$27:$B$51,MATCH('mf3'!B32,'mf1'!$B$27:$B$51,0),1)","v":{"$error":"#N/A"}},{"$f":"INDEX('mf1'!$B$27:$G$51,MATCH('mf3'!B32,'mf1'!$B$27:$B$51,0),6)","v":{"$error":"#N/A"}},"GAIL",null,{"$f":"INDEX(mutualfund3s,MATCH(0,COUNTIF($AE$1:AE6,mutualfund3s),0))","v":"Hero Motocorp"}]
["Giant Cap (%)",{"$f":"'mf1'!B19","v":3.37},{"$f":"'mf2'!B19","v":57.19},{"$f":"'mf3'!B19","v":45.16},null,null,null,null,7,{"$f":"INDEX('mf2'!$B$27:$B$51,MATCH('mf1'!B33,'mf2'!$B$27:$B$51,0),1)","v":{"$error":"#N/A"}},{"$f":"INDEX('mf2'!$B$27:$G$51,MATCH('mf1'!B33,'mf2'!$B$27:$B$51,0),6)","v":{"$error":"#N/A"}},{"$f":"IF(ISERROR(INDEX('mf2'!$B$27:$B$51,MATCH('mf1'!B33,'mf2'!$B$27:$B$51,0),1)),0,1)","v":0},{"$f":"INDEX('mf1'!$B$27:$B$51,MATCH('mf2'!B33,'mf1'!$B$27:$B$51,0),1)","v":{"$error":"#N/A"}},{"$f":"INDEX('mf1'!$B$27:$G$51,MATCH('mf2'!B33,'mf1'!$B$27:$B$51,0),6)","v":{"$error":"#N/A"}},"HDFC Bank",null,{"$f":"INDEX('mf3'!$B$27:$B$51,MATCH('mf2'!B33,'mf3'!$B$27:$B$51,0),1)","v":{"$error":"#N/A"}},{"$f":"INDEX('mf3'!$B$27:$G$51,MATCH('mf2'!B33,'mf3'!$B$27:$B$51,0),6)","v":{"$error":"#N/A"}},{"$f":"IF(ISERROR(INDEX('mf3'!$B$27:$B$51,MATCH('mf2'!B33,'mf3'!$B$27:$B$51,0),1)),0,1)","v":0},{"$f":"INDEX('mf2'!$B$27:$B$51,MATCH('mf3'!B33,'mf2'!$B$27:$B$51,0),1)","v":"ACC"},{"$f":"INDEX('mf2'!$B$27:$G$51,MATCH('mf3'!B33,'mf2'!$B$27:$B$51,0),6)","v":1.46},"ONGC",null,{"$f":"INDEX('mf3'!$B$27:$B$51,MATCH('mf1'!B33,'mf3'!$B$27:$B$51,0),1)","v":"GAIL"},{"$f":"INDEX('mf3'!$B$27:$G$51,MATCH('mf1'!B33,'mf3'!$B$27:$B$51,0),6)","v":2.86},{"$f":"IF(ISERROR(INDEX('mf3'!$B$27:$B$51,MATCH('mf1'!B33,'mf3'!$B$27:$B$51,0),1)),0,1)","v":1},{"$f":"INDEX('mf1'!$B$27:$B$51,MATCH('mf3'!B33,'mf1'!$B$27:$B$51,0),1)","v":{"$error":"#N/A"}},{"$f":"INDEX('mf1'!$B$27:$G$51,MATCH('mf3'!B33,'mf1'!$B$27:$B$51,0),6)","v":{"$error":"#N/A"}},"GAIL",null,{"$f":"INDEX(mutualfund3s,MATCH(0,COUNTIF($AE$1:AE7,mutualfund3s),0))","v":"ACC"}]
["Large Cap(%)",{"$f":"'mf1'!B20","v":17.21},{"$f":"'mf2'!B20","v":29.19},{"$f":"'mf3'!B20","v":14.71},null,null,null,null,8,{"$f":"INDEX('mf2'!$B$27:$B$51,MATCH('mf1'!B34,'mf2'!$B$27:$B$51,0),1)","v":{"$error":"#N/A"}},{"$f":"INDEX('mf2'!$B$27:$G$51,MATCH('mf1'!B34,'mf2'!$B$27:$B$51,0),6)","v":{"$error":"#N/A"}},{"$f":"IF(ISERROR(INDEX('mf2'!$B$27:$B$51,MATCH('mf1'!B34,'mf2'!$B$27:$B$51,0),1)),0,1)","v":0},{"$f":"INDEX('mf1'!$B$27:$B$51,MATCH('mf2'!B34,'mf1'!$B$27:$B$51,0),1)","v":{"$error":"#N/A"}},{"$f":"INDEX('mf1'!$B$27:$G$51,MATCH('mf2'!B34,'mf1'!$B$27:$B$51,0),6)","v":{"$error":"#N/A"}},"HDFC Bank",null,{"$f":"INDEX('mf3'!$B$27:$B$51,MATCH('mf2'!B34,'mf3'!$B$27:$B$51,0),1)","v":{"$error":"#N/A"}},{"$f":"INDEX('mf3'!$B$27:$G$51,MATCH('mf2'!B34,'mf3'!$B$27:$B$51,0),6)","v":{"$error":"#N/A"}},{"$f":"IF(ISERROR(INDEX('mf3'!$B$27:$B$51,MATCH('mf2'!B34,'mf3'!$B$27:$B$51,0),1)),0,1)","v":0},{"$f":"INDEX('mf2'!$B$27:$B$51,MATCH('mf3'!B34,'mf2'!$B$27:$B$51,0),1)","v":{"$error":"#N/A"}},{"$f":"INDEX('mf2'!$B$27:$G$51,MATCH('mf3'!B34,'mf2'!$B$27:$B$51,0),6)","v":{"$error":"#N/A"}},"ONGC",null,{"$f":"INDEX('mf3'!$B$27:$B$51,MATCH('mf1'!B34,'mf3'!$B$27:$B$51,0),1)","v":{"$error":"#N/A"}},{"$f":"INDEX('mf3'!$B$27:$G$51,MATCH('mf1'!B34,'mf3'!$B$27:$B$51,0),6)","v":{"$error":"#N/A"}},{"$f":"IF(ISERROR(INDEX('mf3'!$B$27:$B$51,MATCH('mf1'!B34,'mf3'!$B$27:$B$51,0),1)),0,1)","v":0},{"$f":"INDEX('mf1'!$B$27:$B$51,MATCH('mf3'!B34,'mf1'!$B$27:$B$51,0),1)","v":{"$error":"#N/A"}},{"$f":"INDEX('mf1'!$B$27:$G$51,MATCH('mf3'!B34,'mf1'!$B$27:$B$51,0),6)","v":{"$error":"#N/A"}},"Container Corp.",null,{"$f":"INDEX(mutualfund3s,MATCH(0,COUNTIF($AE$1:AE8,mutualfund3s),0))","v":{"$error":"#N/A"}}]
["Mid Cap(%)",{"$f":"'mf1'!B21","v":53.02},{"$f":"'mf2'!B21","v":13.6},{"$f":"'mf3'!B21","v":36.869999999999997},null,null,null,null,9,{"$f":"INDEX('mf2'!$B$27:$B$51,MATCH('mf1'!B35,'mf2'!$B$27:$B$51,0),1)","v":{"$error":"#N/A"}},{"$f":"INDEX('mf2'!$B$27:$G$51,MATCH('mf1'!B35,'mf2'!$B$27:$B$51,0),6)","v":{"$error":"#N/A"}},{"$f":"IF(ISERROR(INDEX('mf2'!$B$27:$B$51,MATCH('mf1'!B35,'mf2'!$B$27:$B$51,0),1)),0,1)","v":0},{"$f":"INDEX('mf1'!$B$27:$B$51,MATCH('mf2'!B35,'mf1'!$B$27:$B$51,0),1)","v":{"$error":"#N/A"}},{"$f":"INDEX('mf1'!$B$27:$G$51,MATCH('mf2'!B35,'mf1'!$B$27:$B$51,0),6)","v":{"$error":"#N/A"}},"HDFC Bank",null,{"$f":"INDEX('mf3'!$B$27:$B$51,MATCH('mf2'!B35,'mf3'!$B$27:$B$51,0),1)","v":{"$error":"#N/A"}},{"$f":"INDEX('mf3'!$B$27:$G$51,MATCH('mf2'!B35,'mf3'!$B$27:$B$51,0),6)","v":{"$error":"#N/A"}},{"$f":"IF(ISERROR(INDEX('mf3'!$B$27:$B$51,MATCH('mf2'!B35,'mf3'!$B$27:$B$51,0),1)),0,1)","v":0},{"$f":"INDEX('mf2'!$B$27:$B$51,MATCH('mf3'!B35,'mf2'!$B$27:$B$51,0),1)","v":"ONGC"},{"$f":"INDEX('mf2'!$B$27:$G$51,MATCH('mf3'!B35,'mf2'!$B$27:$B$51,0),6)","v":2.88},"ONGC",null,{"$f":"INDEX('mf3'!$B$27:$B$51,MATCH('mf1'!B35,'mf3'!$B$27:$B$51,0),1)","v":"Container Corp."},{"$f":"INDEX('mf3'!$B$27:$G$51,MATCH('mf1'!B35,'mf3'!$B$27:$B$51,0),6)","v":4.1399999999999997},{"$f":"IF(ISERROR(INDEX('mf3'!$B$27:$B$51,MATCH('mf1'!B35,'mf3'!$B$27:$B$51,0),1)),0,1)","v":1},{"$f":"INDEX('mf1'!$B$27:$B$51,MATCH('mf3'!B35,'mf1'!$B$27:$B$51,0),1)","v":{"$error":"#N/A"}},{"$f":"INDEX('mf1'!$B$27:$G$51,MATCH('mf3'!B35,'mf1'!$B$27:$B$51,0),6)","v":{"$error":"#N/A"}},"Container Corp."]
["Small Cap(%)",{"$f":"'mf1'!B22","v":26.1},{"$f":"'mf2'!B22","v":"-"},{"$f":"'mf3'!B22","v":3.26},null,null,null,null,10,{"$f":"INDEX('mf2'!$B$27:$B$51,MATCH('mf1'!B36,'mf2'!$B$27:$B$51,0),1)","v":{"$error":"#N/A"}},{"$f":"INDEX('mf2'!$B$27:$G$51,MATCH('mf1'!B36,'mf2'!$B$27:$B$51,0),6)","v":{"$error":"#N/A"}},{"$f":"IF(ISERROR(INDEX('mf2'!$B$27:$B$51,MATCH('mf1'!B36,'mf2'!$B$27:$B$51,0),1)),0,1)","v":0},{"$f":"INDEX('mf1'!$B$27:$B$51,MATCH('mf2'!B36,'mf1'!$B$27:$B$51,0),1)","v":{"$error":"#N/A"}},{"$f":"INDEX('mf1'!$B$27:$G$51,MATCH('mf2'!B36,'mf1'!$B$27:$B$51,0),6)","v":{"$error":"#N/A"}},"HDFC Bank",null,{"$f":"INDEX('mf3'!$B$27:$B$51,MATCH('mf2'!B36,'mf3'!$B$27:$B$51,0),1)","v":{"$error":"#N/A"}},{"$f":"INDEX('mf3'!$B$27:$G$51,MATCH('mf2'!B36,'mf3'!$B$27:$B$51,0),6)","v":{"$error":"#N/A"}},{"$f":"IF(ISERROR(INDEX('mf3'!$B$27:$B$51,MATCH('mf2'!B36,'mf3'!$B$27:$B$51,0),1)),0,1)","v":0},{"$f":"INDEX('mf2'!$B$27:$B$51,MATCH('mf3'!B36,'mf2'!$B$27:$B$51,0),1)","v":{"$error":"#N/A"}},{"$f":"INDEX('mf2'!$B$27:$G$51,MATCH('mf3'!B36,'mf2'!$B$27:$B$51,0),6)","v":{"$error":"#N/A"}},"ONGC",null,{"$f":"INDEX('mf3'!$B$27:$B$51,MATCH('mf1'!B36,'mf3'!$B$27:$B$51,0),1)","v":{"$error":"#N/A"}},{"$f":"INDEX('mf3'!$B$27:$G$51,MATCH('mf1'!B36,'mf3'!$B$27:$B$51,0),6)","v":{"$error":"#N/A"}},{"$f":"IF(ISERROR(INDEX('mf3'!$B$27:$B$51,MATCH('mf1'!B36,'mf3'!$B$27:$B$51,0),1)),0,1)","v":0},{"$f":"INDEX('mf1'!$B$27:$B$51,MATCH('mf3'!B36,'mf1'!$B$27:$B$51,0),1)","v":{"$error":"#N/A"}},{"$f":"INDEX('mf1'!$B$27:$G$51,MATCH('mf3'!B36,'mf1'!$B$27:$B$51,0),6)","v":{"$error":"#N/A"}},"PTC India"]
["Tiny Cap(%)",{"$f":"'mf1'!B23","v":0.3},{"$f":"'mf2'!B23","v":"-"},{"$f":"'mf3'!B23","v":"-"},null,null,null,null,11,{"$f":"INDEX('mf2'!$B$27:$B$51,MATCH('mf1'!B37,'mf2'!$B$27:$B$51,0),1)","v":{"$error":"#N/A"}},{"$f":"INDEX('mf2'!$B$27:$G$51,MATCH('mf1'!B37,'mf2'!$B$27:$B$51,0),6)","v":{"$error":"#N/A"}},{"$f":"IF(ISERROR(INDEX('mf2'!$B$27:$B$51,MATCH('mf1'!B37,'mf2'!$B$27:$B$51,0),1)),0,1)","v":0},{"$f":"INDEX('mf1'!$B$27:$B$51,MATCH('mf2'!B37,'mf1'!$B$27:$B$51,0),1)","v":{"$error":"#N/A"}},{"$f":"INDEX('mf1'!$B$27:$G$51,MATCH('mf2'!B37,'mf1'!$B$27:$B$51,0),6)","v":{"$error":"#N/A"}},"HDFC Bank",null,{"$f":"INDEX('mf3'!$B$27:$B$51,MATCH('mf2'!B37,'mf3'!$B$27:$B$51,0),1)","v":"ONGC"},{"$f":"INDEX('mf3'!$B$27:$G$51,MATCH('mf2'!B37,'mf3'!$B$27:$B$51,0),6)","v":3.62},{"$f":"IF(ISERROR(INDEX('mf3'!$B$27:$B$51,MATCH('mf2'!B37,'mf3'!$B$27:$B$51,0),1)),0,1)","v":1},{"$f":"INDEX('mf2'!$B$27:$B$51,MATCH('mf3'!B37,'mf2'!$B$27:$B$51,0),1)","v":{"$error":"#N/A"}},{"$f":"INDEX('mf2'!$B$27:$G$51,MATCH('mf3'!B37,'mf2'!$B$27:$B$51,0),6)","v":{"$error":"#N/A"}},"ONGC",null,{"$f":"INDEX('mf3'!$B$27:$B$51,MATCH('mf1'!B37,'mf3'!$B$27:$B$51,0),1)","v":{"$error":"#N/A"}},{"$f":"INDEX('mf3'!$B$27:$G$51,MATCH('mf1'!B37,'mf3'!$B$27:$B$51,0),6)","v":{"$error":"#N/A"}},{"$f":"IF(ISERROR(INDEX('mf3'!$B$27:$B$51,MATCH('mf1'!B37,'mf3'!$B$27:$B$51,0),1)),0,1)","v":0},{"$f":"INDEX('mf1'!$B$27:$B$51,MATCH('mf3'!B37,'mf1'!$B$27:$B$51,0),1)","v":{"$error":"#N/A"}},{"$f":"INDEX('mf1'!$B$27:$G$51,MATCH('mf3'!B37,'mf1'!$B$27:$B$51,0),6)","v":{"$error":"#N/A"}},"PTC India"]
[null,null,null,null,null,null,null,null,12,{"$f":"INDEX('mf2'!$B$27:$B$51,MATCH('mf1'!B38,'mf2'!$B$27:$B$51,0),1)","v":{"$error":"#N/A"}},{"$f":"INDEX('mf2'!$B$27:$G$51,MATCH('mf1'!B38,'mf2'!$B$27:$B$51,0),6)","v":{"$error":"#N/A"}},{"$f":"IF(ISERROR(INDEX('mf2'!$B$27:$B$51,MATCH('mf1'!B38,'mf2'!$B$27:$B$51,0),1)),0,1)","v":0},{"$f":"INDEX('mf1'!$B$27:$B$51,MATCH('mf2'!B38,'mf1'!$B$27:$B$51,0),1)","v":{"$error":"#N/A"}},{"$f":"INDEX('mf1'!$B$27:$G$51,MATCH('mf2'!B38,'mf1'!$B$27:$B$51,0),6)","v":{"$error":"#N/A"}},"HDFC Bank",null,{"$f":"INDEX('mf3'!$B$27:$B$51,MATCH('mf2'!B38,'mf3'!$B$27:$B$51,0),1)","v":"NTPC"},{"$f":"INDEX('mf3'!$B$27:$G$51,MATCH('mf2'!B38,'mf3'!$B$27:$B$51,0),6)","v":2.29},{"$f":"IF(ISERROR(INDEX('mf3'!$B$27:$B$51,MATCH('mf2'!B38,'mf3'!$B$27:$B$51,0),1)),0,1)","v":1},{"$f":"INDEX('mf2'!$B$27:$B$51,MATCH('mf3'!B38,'mf2'!$B$27:$B$51,0),1)","v":{"$error":"#N/A"}},{"$f":"INDEX('mf2'!$B$27:$G$51,MATCH('mf3'!B38,'mf2'!$B$27:$B$51,0),6)","v":{"$error":"#N/A"}},"NTPC",null,{"$f":"INDEX('mf3'!$B$27:$B$51,MATCH('mf1'!B38,'mf3'!$B$27:$B$51,0),1)","v":{"$error":"#N/A"}},{"$f":"INDEX('mf3'!$B$27:$G$51,MATCH('mf1'!B38,'mf3'!$B$27:$B$51,0),6)","v":{"$error":"#N/A"}},{"$f":"IF(ISERROR(INDEX('mf3'!$B$27:$B$51,MATCH('mf1'!B38,'mf3'!$B$27:$B$51,0),1)),0,1)","v":0},{"$f":"INDEX('mf1'!$B$27:$B$51,MATCH('mf3'!B38,'mf1'!$B$27:$B$51,0),1)","v":{"$error":"#N/A"}},{"$f":"INDEX('mf1'!$B$27:$G$51,MATCH('mf3'!B38,'mf1'!$B$27:$B$51,0),6)","v":{"$error":"#N/A"}},"PTC India"]
["% equity portfolio displayed by VR Online",{"$f":"SUM('mf1'!G27:G75)","v":68.700000000000017},{"$f":"SUM('mf2'!G27:G75)","v":83.200000000000017},{"$f":"SUM('mf3'!G27:G75)","v":80.600000000000009},null,null,null,null,13,{"$f":"INDEX('mf2'!$B$27:$B$51,MATCH('mf1'!B39,'mf2'!$B$27:$B$51,0),1)","v":{"$error":"#N/A"}},{"$f":"INDEX('mf2'!$B$27:$G$51,MATCH('mf1'!B39,'mf2'!$B$27:$B$51,0),6)","v":{"$error":"#N/A"}},{"$f":"IF(ISERROR(INDEX('mf2'!$B$27:$B$51,MATCH('mf1'!B39,'mf2'!$B$27:$B$51,0),1)),0,1)","v":0},{"$f":"INDEX('mf1'!$B$27:$B$51,MATCH('mf2'!B39,'mf1'!$B$27:$B$51,0),1)","v":{"$error":"#N/A"}},{"$f":"INDEX('mf1'!$B$27:$G$51,MATCH('mf2'!B39,'mf1'!$B$27:$B$51,0),6)","v":{"$error":"#N/A"}},"HDFC Bank",null,{"$f":"INDEX('mf3'!$B$27:$B$51,MATCH('mf2'!B39,'mf3'!$B$27:$B$51,0),1)","v":{"$error":"#N/A"}},{"$f":"INDEX('mf3'!$B$27:$G$51,MATCH('mf2'!B39,'mf3'!$B$27:$B$51,0),6)","v":{"$error":"#N/A"}},{"$f":"IF(ISERROR(INDEX('mf3'!$B$27:$B$51,MATCH('mf2'!B39,'mf3'!$B$27:$B$51,0),1)),0,1)","v":0},{"$f":"INDEX('mf2'!$B$27:$B$51,MATCH('mf3'!B39,'mf2'!$B$27:$B$51,0),1)","v":"Hero Motocorp"},{"$f":"INDEX('mf2'!$B$27:$G$51,MATCH('mf3'!B39,'mf2'!$B$27:$B$51,0),6)","v":1.61},"Larsen & Toubro",null,{"$f":"INDEX('mf3'!$B$27:$B$51,MATCH('mf1'!B39,'mf3'!$B$27:$B$51,0),1)","v":{"$error":"#N/A"}},{"$f":"INDEX('mf3'!$B$27:$G$51,MATCH('mf1'!B39,'mf3'!$B$27:$B$51,0),6)","v":{"$error":"#N/A"}},{"$f":"IF(ISERROR(INDEX('mf3'!$B$27:$B$51,MATCH('mf1'!B39,'mf3'!$B$27:$B$51,0),1)),0,1)","v":0},{"$f":"INDEX('mf1'!$B$27:$B$51,MATCH('mf3'!B39,'mf1'!$B$27:$B$51,0),1)","v":{"$error":"#N/A"}},{"$f":"INDEX('mf1'!$B$27:$G$51,MATCH('mf3'!B39,'mf1'!$B$27:$B$51,0),6)","v":{"$error":"#N/A"}},"PTC India"]
[null,null,null,null,null,null,null,null,14,{"$f":"INDEX('mf2'!$B$27:$B$51,MATCH('mf1'!B40,'mf2'!$B$27:$B$51,0),1)","v":{"$error":"#N/A"}},{"$f":"INDEX('mf2'!$B$27:$G$51,MATCH('mf1'!B40,'mf2'!$B$27:$B$51,0),6)","v":{"$error":"#N/A"}},{"$f":"IF(ISERROR(INDEX('mf2'!$B$27:$B$51,MATCH('mf1'!B40,'mf2'!$B$27:$B$51,0),1)),0,1)","v":0},{"$f":"INDEX('mf1'!$B$27:$B$51,MATCH('mf2'!B40,'mf1'!$B$27:$B$51,0),1)","v":{"$error":"#N/A"}},{"$f":"INDEX('mf1'!$B$27:$G$51,MATCH('mf2'!B40,'mf1'!$B$27:$B$51,0),6)","v":{"$error":"#N/A"}},"HDFC Bank",null,{"$f":"INDEX('mf3'!$B$27:$B$51,MATCH('mf2'!B40,'mf3'!$B$27:$B$51,0),1)","v":{"$error":"#N/A"}},{"$f":"INDEX('mf3'!$B$27:$G$51,MATCH('mf2'!B40,'mf3'!$B$27:$B$51,0),6)","v":{"$error":"#N/A"}},{"$f":"IF(ISERROR(INDEX('mf3'!$B$27:$B$51,MATCH('mf2'!B40,'mf3'!$B$27:$B$51,0),1)),0,1)","v":0},{"$f":"INDEX('mf2'!$B$27:$B$51,MATCH('mf3'!B40,'mf2'!$B$27:$B$51,0),1)","v":{"$error":"#N/A"}},{"$f":"INDEX('mf2'!$B$27:$G$51,MATCH('mf3'!B40,'mf2'!$B$27:$B$51,0),6)","v":{"$error":"#N/A"}},"Larsen & Toubro",null,{"$f":"INDEX('mf3'!$B$27:$B$51,MATCH('mf1'!B40,'mf3'!$B$27:$B$51,0),1)","v":{"$error":"#N/A"}},{"$f":"INDEX('mf3'!$B$27:$G$51,MATCH('mf1'!B40,'mf3'!$B$27:$B$51,0),6)","v":{"$error":"#N/A"}},{"$f":"IF(ISERROR(INDEX('mf3'!$B$27:$B$51,MATCH('mf1'!B40,'mf3'!$B$27:$B$51,0),1)),0,1)","v":0},{"$f":"INDEX('mf1'!$B$27:$B$51,MATCH('mf3'!B40,'mf1'!$B$27:$B$51,0),1)","v":{"$error":"#N/A"}},{"$f":"INDEX('mf1'!$B$27:$G$51,MATCH('mf3'!B40,'mf1'!$B$27:$B$51,0),6)","v":{"$error":"#N/A"}},"PTC India"]
[null,null,null,null,null,null,null,null,15,{"$f":"INDEX('mf2'!$B$27:$B$51,MATCH('mf1'!B41,'mf2'!$B$27:$B$51,0),1)","v":"HDFC Bank"},{"$f":"INDEX('mf2'!$B$27:$G$51,MATCH('mf1'!B41,'mf2'!$B$27:$B$51,0),6)","v":5.68},{"$f":"IF(ISERROR(INDEX('mf2'!$B$27:$B$51,MATCH('mf1'!B41,'mf2'!$B$27:$B$51,0),1)),0,1)","v":1},{"$f":"INDEX('mf1'!$B$27:$B$51,MATCH('mf2'!B41,'mf1'!$B$27:$B$51,0),1)","v":{"$error":"#N/A"}},{"$f":"INDEX('mf1'!$B$27:$G$51,MATCH('mf2'!B41,'mf1'!$B$27:$B$51,0),6)","v":{"$error":"#N/A"}},"HDFC Bank",null,{"$f":"INDEX('mf3'!$B$27:$B$51,MATCH('mf2'!B41,'mf3'!$B$27:$B$51,0),1)","v":"Larsen & Toubro"},{"$f":"INDEX('mf3'!$B$27:$G$51,MATCH('mf2'!B41,'mf3'!$B$27:$B$51,0),6)","v":2.31},{"$f":"IF(ISERROR(INDEX('mf3'!$B$27:$B$51,MATCH('mf2'!B41,'mf3'!$B$27:$B$51,0),1)),0,1)","v":1},{"$f":"INDEX('mf2'!$B$27:$B$51,MATCH('mf3'!B41,'mf2'!$B$27:$B$51,0),1)","v":{"$error":"#N/A"}},{"$f":"INDEX('mf2'!$B$27:$G$51,MATCH('mf3'!B41,'mf2'!$B$27:$B$51,0),6)","v":{"$error":"#N/A"}},"Larsen & Toubro",null,{"$f":"INDEX('mf3'!$B$27:$B$51,MATCH('mf1'!B41,'mf3'!$B$27:$B$51,0),1)","v":{"$error":"#N/A"}},{"$f":"INDEX('mf3'!$B$27:$G$51,MATCH('mf1'!B41,'mf3'!$B$27:$B$51,0),6)","v":{"$error":"#N/A"}},{"$f":"IF(ISERROR(INDEX('mf3'!$B$27:$B$51,MATCH('mf1'!B41,'mf3'!$B$27:$B$51,0),1)),0,1)","v":0},{"$f":"INDEX('mf1'!$B$27:$B$51,MATCH('mf3'!B41,'mf1'!$B$27:$B$51,0),1)","v":"GAIL"},{"$f":"INDEX('mf1'!$B$27:$G$51,MATCH('mf3'!B41,'mf1'!$B$27:$B$51,0),6)","v":3},"PTC India"]
[{"$f":"CONCATENATE(\"% overlap in equity portfolio as listed in VROnline between\")","v":"% overlap in equity portfolio as listed in VROnline between"},null,null,null,null,null,null,null,16,{"$f":"INDEX('mf2'!$B$27:$B$51,MATCH('mf1'!B42,'mf2'!$B$27:$B$51,0),1)","v":{"$error":"#N/A"}},{"$f":"INDEX('mf2'!$B$27:$G$51,MATCH('mf1'!B42,'mf2'!$B$27:$B$51,0),6)","v":{"$error":"#N/A"}},{"$f":"IF(ISERROR(INDEX('mf2'!$B$27:$B$51,MATCH('mf1'!B42,'mf2'!$B$27:$B$51,0),1)),0,1)","v":0},{"$f":"INDEX('mf1'!$B$27:$B$51,MATCH('mf2'!B42,'mf1'!$B$27:$B$51,0),1)","v":{"$error":"#N/A"}},{"$f":"INDEX('mf1'!$B$27:$G$51,MATCH('mf2'!B42,'mf1'!$B$27:$B$51,0),6)","v":{"$error":"#N/A"}},0,null,{"$f":"INDEX('mf3'!$B$27:$B$51,MATCH('mf2'!B42,'mf3'!$B$27:$B$51,0),1)","v":"HDFC"},{"$f":"INDEX('mf3'!$B$27:$G$51,MATCH('mf2'!B42,'mf3'!$B$27:$B$51,0),6)","v":5.61},{"$f":"IF(ISERROR(INDEX('mf3'!$B$27:$B$51,MATCH('mf2'!B42,'mf3'!$B$27:$B$51,0),1)),0,1)","v":1},{"$f":"INDEX('mf2'!$B$27:$B$51,MATCH('mf3'!B42,'mf2'!$B$27:$B$51,0),1)","v":{"$error":"#N/A"}},{"$f":"INDEX('mf2'!$B$27:$G$51,MATCH('mf3'!B42,'mf2'!$B$27:$B$51,0),6)","v":{"$error":"#N/A"}},"HDFC",null,{"$f":"INDEX('mf3'!$B$27:$B$51,MATCH('mf1'!B42,'mf3'!$B$27:$B$51,0),1)","v":{"$error":"#N/A"}},{"$f":"INDEX('mf3'!$B$27:$G$51,MATCH('mf1'!B42,'mf3'!$B$27:$B$51,0),6)","v":{"$error":"#N/A"}},{"$f":"IF(ISERROR(INDEX('mf3'!$B$27:$B$51,MATCH('mf1'!B42,'mf3'!$B$27:$B$51,0),1)),0,1)","v":0},{"$f":"INDEX('mf1'!$B$27:$B$51,MATCH('mf3'!B42,'mf1'!$B$27:$B$51,0),1)","v":{"$error":"#N/A"}},{"$f":"INDEX('mf1'!$B$27:$G$51,MATCH('mf3'!B42,'mf1'!$B$27:$B$51,0),6)","v":{"$error":"#N/A"}},"PTC India"]
[{"$f":"B2","v":"IDFC Premier Equity Direct"},{"$f":"SUM(L2:L26)/25","v":0.08},null,null,null,null,null,null,17,{"$f":"INDEX('mf2'!$B$27:$B$51,MATCH('mf1'!B43,'mf2'!$B$27:$B$51,0),1)","v":{"$error":"#N/A"}},{"$f":"INDEX('mf2'!$B$27:$G$51,MATCH('mf1'!B43,'mf2'!$B$27:$B$51,0),6)","v":{"$error":"#N/A"}},{"$f":"IF(ISERROR(INDEX('mf2'!$B$27:$B$51,MATCH('mf1'!B43,'mf2'!$B$27:$B$51,0),1)),0,1)","v":0},{"$f":"INDEX('mf1'!$B$27:$B$51,MATCH('mf2'!B43,'mf1'!$B$27:$B$51,0),1)","v":{"$error":"#N/A"}},{"$f":"INDEX('mf1'!$B$27:$G$51,MATCH('mf2'!B43,'mf1'!$B$27:$B$51,0),6)","v":{"$error":"#N/A"}},0,null,{"$f":"INDEX('mf3'!$B$27:$B$51,MATCH('mf2'!B43,'mf3'!$B$27:$B$51,0),1)","v":{"$error":"#N/A"}},{"$f":"INDEX('mf3'!$B$27:$G$51,MATCH('mf2'!B43,'mf3'!$B$27:$B$51,0),6)","v":{"$error":"#N/A"}},{"$f":"IF(ISERROR(INDEX('mf3'!$B$27:$B$51,MATCH('mf2'!B43,'mf3'!$B$27:$B$51,0),1)),0,1)","v":0},{"$f":"INDEX('mf2'!$B$27:$B$51,MATCH('mf3'!B43,'mf2'!$B$27:$B$51,0),1)","v":{"$error":"#N/A"}},{"$f":"INDEX('mf2'!$B$27:$G$51,MATCH('mf3'!B43,'mf2'!$B$27:$B$51,0),6)","v":{"$error":"#N/A"}},"Hero Motocorp",null,{"$f":"INDEX('mf3'!$B$27:$B$51,MATCH('mf1'!B43,'mf3'!$B$27:$B$51,0),1)","v":{"$error":"#N/A"}},{"$f":"INDEX('mf3'!$B$27:$G$51,MATCH('mf1'!B43,'mf3'!$B$27:$B$51,0),6)","v":{"$error":"#N/A"}},{"$f":"IF(ISERROR(INDEX('mf3'!$B$27:$B$51,MATCH('mf1'!B43,'mf3'!$B$27:$B$51,0),1)),0,1)","v":0},{"$f":"INDEX('mf1'!$B$27:$B$51,MATCH('mf3'!B43,'mf1'!$B$27:$B$51,0),1)","v":{"$error":"#N/A"}},{"$f":"INDEX('mf1'!$B$27:$G$51,MATCH('mf3'!B43,'mf1'!$B$27:$B$51,0),6)","v":{"$error":"#N/A"}},"PTC India"]
[{"$f":"C2","v":"Franklin India Bluechip"},null,null,null,null,null,null,null,18,{"$f":"INDEX('mf2'!$B$27:$B$51,MATCH('mf1'!B44,'mf2'!$B$27:$B$51,0),1)","v":{"$error":"#N/A"}},{"$f":"INDEX('mf2'!$B$27:$G$51,MATCH('mf1'!B44,'mf2'!$B$27:$B$51,0),6)","v":{"$error":"#N/A"}},{"$f":"IF(ISERROR(INDEX('mf2'!$B$27:$B$51,MATCH('mf1'!B44,'mf2'!$B$27:$B$51,0),1)),0,1)","v":0},{"$f":"INDEX('mf1'!$B$27:$B$51,MATCH('mf2'!B44,'mf1'!$B$27:$B$51,0),1)","v":{"$error":"#N/A"}},{"$f":"INDEX('mf1'!$B$27:$G$51,MATCH('mf2'!B44,'mf1'!$B$27:$B$51,0),6)","v":{"$error":"#N/A"}},0,null,{"$f":"INDEX('mf3'!$B$27:$B$51,MATCH('mf2'!B44,'mf3'!$B$27:$B$51,0),1)","v":{"$error":"#N/A"}},{"$f":"INDEX('mf3'!$B$27:$G$51,MATCH('mf2'!B44,'mf3'!$B$27:$B$51,0),6)","v":{"$error":"#N/A"}},{"$f":"IF(ISERROR(INDEX('mf3'!$B$27:$B$51,MATCH('mf2'!B44,'mf3'!$B$27:$B$51,0),1)),0,1)","v":0},{"$f":"INDEX('mf2'!$B$27:$B$51,MATCH('mf3'!B44,'mf2'!$B$27:$B$51,0),1)","v":"Larsen & Toubro"},{"$f":"INDEX('mf2'!$B$27:$G$51,MATCH('mf3'!B44,'mf2'!$B$27:$B$51,0),6)","v":2.12},"Hero Motocorp",null,{"$f":"INDEX('mf3'!$B$27:$B$51,MATCH('mf1'!B44,'mf3'!$B$27:$B$51,0),1)","v":"PTC India"},{"$f":"INDEX('mf3'!$B$27:$G$51,MATCH('mf1'!B44,'mf3'!$B$27:$B$51,0),6)","v":2.14},{"$f":"IF(ISERROR(INDEX('mf3'!$B$27:$B$51,MATCH('mf1'!B44,'mf3'!$B$27:$B$51,0),1)),0,1)","v":1},{"$f":"INDEX('mf1'!$B$27:$B$51,MATCH('mf3'!B44,'mf1'!$B$27:$B$51,0),1)","v":{"$error":"#N/A"}},{"$f":"INDEX('mf1'!$B$27:$G$51,MATCH('mf3'!B44,'mf1'!$B$27:$B$51,0),6)","v":{"$error":"#N/A"}},"PTC India"]
[null,null,null,null,null,null,null,null,19,{"$f":"INDEX('mf2'!$B$27:$B$51,MATCH('mf1'!B45,'mf2'!$B$27:$B$51,0),1)","v":{"$error":"#N/A"}},{"$f":"INDEX('mf2'!$B$27:$G$51,MATCH('mf1'!B45,'mf2'!$B$27:$B$51,0),6)","v":{"$error":"#N/A"}},{"$f":"IF(ISERROR(INDEX('mf2'!$B$27:$B$51,MATCH('mf1'!B45,'mf2'!$B$27:$B$51,0),1)),0,1)","v":0},{"$f":"INDEX('mf1'!$B$27:$B$51,MATCH('mf2'!B45,'mf1'!$B$27:$B$51,0),1)","v":{"$error":"#N/A"}},{"$f":"INDEX('mf1'!$B$27:$G$51,MATCH('mf2'!B45,'mf1'!$B$27:$B$51,0),6)","v":{"$error":"#N/A"}},0,null,{"$f":"INDEX('mf3'!$B$27:$B$51,MATCH('mf2'!B45,'mf3'!$B$27:$B$51,0),1)","v":{"$error":"#N/A"}},{"$f":"INDEX('mf3'!$B$27:$G$51,MATCH('mf2'!B45,'mf3'!$B$27:$B$51,0),6)","v":{"$error":"#N/A"}},{"$f":"IF(ISERROR(INDEX('mf3'!$B$27:$B$51,MATCH('mf2'!B45,'mf3'!$B$27:$B$51,0),1)),0,1)","v":0},{"$f":"INDEX('mf2'!$B$27:$B$51,MATCH('mf3'!B45,'mf2'!$B$27:$B$51,0),1)","v":"NTPC"},{"$f":"INDEX('mf2'!$B$27:$G$51,MATCH('mf3'!B45,'mf2'!$B$27:$B$51,0),6)","v":2.8},"Hero Motocorp",null,{"$f":"INDEX('mf3'!$B$27:$B$51,MATCH('mf1'!B45,'mf3'!$B$27:$B$51,0),1)","v":{"$error":"#N/A"}},{"$f":"INDEX('mf3'!$B$27:$G$51,MATCH('mf1'!B45,'mf3'!$B$27:$B$51,0),6)","v":{"$error":"#N/A"}},{"$f":"IF(ISERROR(INDEX('mf3'!$B$27:$B$51,MATCH('mf1'!B45,'mf3'!$B$27:$B$51,0),1)),0,1)","v":0},{"$f":"INDEX('mf1'!$B$27:$B$51,MATCH('mf3'!B45,'mf1'!$B$27:$B$51,0),1)","v":{"$error":"#N/A"}},{"$f":"INDEX('mf1'!$B$27:$G$51,MATCH('mf3'!B45,'mf1'!$B$27:$B$51,0),6)","v":{"$error":"#N/A"}},0]
[{"$f":"B2","v":"IDFC Premier Equity Direct"},{"$f":"SUM(Z2:Z26)/25","v":0.12},null,null,null,null,null,null,20,{"$f":"INDEX('mf2'!$B$27:$B$51,MATCH('mf1'!B46,'mf2'!$B$27:$B$51,0),1)","v":{"$error":"#N/A"}},{"$f":"INDEX('mf2'!$B$27:$G$51,MATCH('mf1'!B46,'mf2'!$B$27:$B$51,0),6)","v":{"$error":"#N/A"}},{"$f":"IF(ISERROR(INDEX('mf2'!$B$27:$B$51,MATCH('mf1'!B46,'mf2'!$B$27:$B$51,0),1)),0,1)","v":0},{"$f":"INDEX('mf1'!$B$27:$B$51,MATCH('mf2'!B46,'mf1'!$B$27:$B$51,0),1)","v":{"$error":"#N/A"}},{"$f":"INDEX('mf1'!$B$27:$G$51,MATCH('mf2'!B46,'mf1'!$B$27:$B$51,0),6)","v":{"$error":"#N/A"}},0,null,{"$f":"INDEX('mf3'!$B$27:$B$51,MATCH('mf2'!B46,'mf3'!$B$27:$B$51,0),1)","v":{"$error":"#N/A"}},{"$f":"INDEX('mf3'!$B$27:$G$51,MATCH('mf2'!B46,'mf3'!$B$27:$B$51,0),6)","v":{"$error":"#N/A"}},{"$f":"IF(ISERROR(INDEX('mf3'!$B$27:$B$51,MATCH('mf2'!B46,'mf3'!$B$27:$B$51,0),1)),0,1)","v":0},{"$f":"INDEX('mf2'!$B$27:$B$51,MATCH('mf3'!B46,'mf2'!$B$27:$B$51,0),1)","v":{"$error":"#N/A"}},{"$f":"INDEX('mf2'!$B$27:$G$51,MATCH('mf3'!B46,'mf2'!$B$27:$B$51,0),6)","v":{"$error":"#N/A"}},"Hero Motocorp",null,{"$f":"INDEX('mf3'!$B$27:$B$51,MATCH('mf1'!B46,'mf3'!$B$27:$B$51,0),1)","v":{"$error":"#N/A"}},{"$f":"INDEX('mf3'!$B$27:$G$51,MATCH('mf1'!B46,'mf3'!$B$27:$B$51,0),6)","v":{"$error":"#N/A"}},{"$f":"IF(ISERROR(INDEX('mf3'!$B$27:$B$51,MATCH('mf1'!B46,'mf3'!$B$27:$B$51,0),1)),0,1)","v":0},{"$f":"INDEX('mf1'!$B$27:$B$51,MATCH('mf3'!B46,'mf1'!$B$27:$B$51,0),1)","v":{"$error":"#N/A"}},{"$f":"INDEX('mf1'!$B$27:$G$51,MATCH('mf3'!B46,'mf1'!$B$27:$B$51,0),6)","v":{"$error":"#N/A"}},0]
[{"$f":"D2","v":"Quantum Long Term Equity"},null,null,null,null,null,null,null,21,{"$f":"INDEX('mf2'!$B$27:$B$51,MATCH('mf1'!B47,'mf2'!$B$27:$B$51,0),1)","v":{"$error":"#N/A"}},{"$f":"INDEX('mf2'!$B$27:$G$51,MATCH('mf1'!B47,'mf2'!$B$27:$B$51,0),6)","v":{"$error":"#N/A"}},{"$f":"IF(ISERROR(INDEX('mf2'!$B$27:$B$51,MATCH('mf1'!B47,'mf2'!$B$27:$B$51,0),1)),0,1)","v":0},{"$f":"INDEX('mf1'!$B$27:$B$51,MATCH('mf2'!B47,'mf1'!$B$27:$B$51,0),1)","v":{"$error":"#N/A"}},{"$f":"INDEX('mf1'!$B$27:$G$51,MATCH('mf2'!B47,'mf1'!$B$27:$B$51,0),6)","v":{"$error":"#N/A"}},0,null,{"$f":"INDEX('mf3'!$B$27:$B$51,MATCH('mf2'!B47,'mf3'!$B$27:$B$51,0),1)","v":"Hero Motocorp"},{"$f":"INDEX('mf3'!$B$27:$G$51,MATCH('mf2'!B47,'mf3'!$B$27:$B$51,0),6)","v":2.88},{"$f":"IF(ISERROR(INDEX('mf3'!$B$27:$B$51,MATCH('mf2'!B47,'mf3'!$B$27:$B$51,0),1)),0,1)","v":1},{"$f":"INDEX('mf2'!$B$27:$B$51,MATCH('mf3'!B47,'mf2'!$B$27:$B$51,0),1)","v":{"$error":"#N/A"}},{"$f":"INDEX('mf2'!$B$27:$G$51,MATCH('mf3'!B47,'mf2'!$B$27:$B$51,0),6)","v":{"$error":"#N/A"}},"Hero Motocorp",null,{"$f":"INDEX('mf3'!$B$27:$B$51,MATCH('mf1'!B47,'mf3'!$B$27:$B$51,0),1)","v":{"$error":"#N/A"}},{"$f":"INDEX('mf3'!$B$27:$G$51,MATCH('mf1'!B47,'mf3'!$B$27:$B$51,0),6)","v":{"$error":"#N/A"}},{"$f":"IF(ISERROR(INDEX('mf3'!$B$27:$B$51,MATCH('mf1'!B47,'mf3'!$B$27:$B$51,0),1)),0,1)","v":0},{"$f":"INDEX('mf1'!$B$27:$B$51,MATCH('mf3'!B47,'mf1'!$B$27:$B$51,0),1)","v":{"$error":"#N/A"}},{"$f":"INDEX('mf1'!$B$27:$G$51,MATCH('mf3'!B47,'mf1'!$B$27:$B$51,0),6)","v":{"$error":"#N/A"}},0]
[null,null,null,null,null,null,null,null,22,{"$f":"INDEX('mf2'!$B$27:$B$51,MATCH('mf1'!B48,'mf2'!$B$27:$B$51,0),1)","v":{"$error":"#N/A"}},{"$f":"INDEX('mf2'!$B$27:$G$51,MATCH('mf1'!B48,'mf2'!$B$27:$B$51,0),6)","v":{"$error":"#N/A"}},{"$f":"IF(ISERROR(INDEX('mf2'!$B$27:$B$51,MATCH('mf1'!B48,'mf2'!$B$27:$B$51,0),1)),0,1)","v":0},{"$f":"INDEX('mf1'!$B$27:$B$51,MATCH('mf2'!B48,'mf1'!$B$27:$B$51,0),1)","v":{"$error":"#N/A"}},{"$f":"INDEX('mf1'!$B$27:$G$51,MATCH('mf2'!B48,'mf1'!$B$27:$B$51,0),6)","v":{"$error":"#N/A"}},0,null,{"$f":"INDEX('mf3'!$B$27:$B$51,MATCH('mf2'!B48,'mf3'!$B$27:$B$51,0),1)","v":{"$error":"#N/A"}},{"$f":"INDEX('mf3'!$B$27:$G$51,MATCH('mf2'!B48,'mf3'!$B$27:$B$51,0),6)","v":{"$error":"#N/A"}},{"$f":"IF(ISERROR(INDEX('mf3'!$B$27:$B$51,MATCH('mf2'!B48,'mf3'!$B$27:$B$51,0),1)),0,1)","v":0},{"$f":"INDEX('mf2'!$B$27:$B$51,MATCH('mf3'!B48,'mf2'!$B$27:$B$51,0),1)","v":{"$error":"#N/A"}},{"$f":"INDEX('mf2'!$B$27:$G$51,MATCH('mf3'!B48,'mf2'!$B$27:$B$51,0),6)","v":{"$error":"#N/A"}},"ACC",null,{"$f":"INDEX('mf3'!$B$27:$B$51,MATCH('mf1'!B48,'mf3'!$B$27:$B$51,0),1)","v":{"$error":"#N/A"}},{"$f":"INDEX('mf3'!$B$27:$G$51,MATCH('mf1'!B48,'mf3'!$B$27:$B$51,0),6)","v":{"$error":"#N/A"}},{"$f":"IF(ISERROR(INDEX('mf3'!$B$27:$B$51,MATCH('mf1'!B48,'mf3'!$B$27:$B$51,0),1)),0,1)","v":0},{"$f":"INDEX('mf1'!$B$27:$B$51,MATCH('mf3'!B48,'mf1'!$B$27:$B$51,0),1)","v":"PTC India"},{"$f":"INDEX('mf1'!$B$27:$G$51,MATCH('mf3'!B48,'mf1'!$B$27:$B$51,0),6)","v":1.85},0]
[{"$f":"C2","v":"Franklin India Bluechip"},{"$f":"SUM(S2:S26)/25","v":0.28000000000000003},null,null,null,null,null,null,23,{"$f":"INDEX('mf2'!$B$27:$B$51,MATCH('mf1'!B49,'mf2'!$B$27:$B$51,0),1)","v":{"$error":"#N/A"}},{"$f":"INDEX('mf2'!$B$27:$G$51,MATCH('mf1'!B49,'mf2'!$B$27:$B$51,0),6)","v":{"$error":"#N/A"}},{"$f":"IF(ISERROR(INDEX('mf2'!$B$27:$B$51,MATCH('mf1'!B49,'mf2'!$B$27:$B$51,0),1)),0,1)","v":0},{"$f":"INDEX('mf1'!$B$27:$B$51,MATCH('mf2'!B49,'mf1'!$B$27:$B$51,0),1)","v":"Asian Paints"},{"$f":"INDEX('mf1'!$B$27:$G$51,MATCH('mf2'!B49,'mf1'!$B$27:$B$51,0),6)","v":3.27},0,null,{"$f":"INDEX('mf3'!$B$27:$B$51,MATCH('mf2'!B49,'mf3'!$B$27:$B$51,0),1)","v":{"$error":"#N/A"}},{"$f":"INDEX('mf3'!$B$27:$G$51,MATCH('mf2'!B49,'mf3'!$B$27:$B$51,0),6)","v":{"$error":"#N/A"}},{"$f":"IF(ISERROR(INDEX('mf3'!$B$27:$B$51,MATCH('mf2'!B49,'mf3'!$B$27:$B$51,0),1)),0,1)","v":0},{"$f":"INDEX('mf2'!$B$27:$B$51,MATCH('mf3'!B49,'mf2'!$B$27:$B$51,0),1)","v":{"$error":"#N/A"}},{"$f":"INDEX('mf2'!$B$27:$G$51,MATCH('mf3'!B49,'mf2'!$B$27:$B$51,0),6)","v":{"$error":"#N/A"}},"ACC",null,{"$f":"INDEX('mf3'!$B$27:$B$51,MATCH('mf1'!B49,'mf3'!$B$27:$B$51,0),1)","v":{"$error":"#N/A"}},{"$f":"INDEX('mf3'!$B$27:$G$51,MATCH('mf1'!B49,'mf3'!$B$27:$B$51,0),6)","v":{"$error":"#N/A"}},{"$f":"IF(ISERROR(INDEX('mf3'!$B$27:$B$51,MATCH('mf1'!B49,'mf3'!$B$27:$B$51,0),1)),0,1)","v":0},{"$f":"INDEX('mf1'!$B$27:$B$51,MATCH('mf3'!B49,'mf1'!$B$27:$B$51,0),1)","v":{"$error":"#N/A"}},{"$f":"INDEX('mf1'!$B$27:$G$51,MATCH('mf3'!B49,'mf1'!$B$27:$B$51,0),6)","v":{"$error":"#N/A"}},0]
[{"$f":"D2","v":"Quantum Long Term Equity"},null,null,null,null,null,null,null,24,{"$f":"INDEX('mf2'!$B$27:$B$51,MATCH('mf1'!B50,'mf2'!$B$27:$B$51,0),1)","v":{"$error":"#N/A"}},{"$f":"INDEX('mf2'!$B$27:$G$51,MATCH('mf1'!B50,'mf2'!$B$27:$B$51,0),6)","v":{"$error":"#N/A"}},{"$f":"IF(ISERROR(INDEX('mf2'!$B$27:$B$51,MATCH('mf1'!B50,'mf2'!$B$27:$B$51,0),1)),0,1)","v":0},{"$f":"INDEX('mf1'!$B$27:$B$51,MATCH('mf2'!B50,'mf1'!$B$27:$B$51,0),1)","v":{"$error":"#N/A"}},{"$f":"INDEX('mf1'!$B$27:$G$51,MATCH('mf2'!B50,'mf1'!$B$27:$B$51,0),6)","v":{"$error":"#N/A"}},0,null,{"$f":"INDEX('mf3'!$B$27:$B$51,MATCH('mf2'!B50,'mf3'!$B$27:$B$51,0),1)","v":{"$error":"#N/A"}},{"$f":"INDEX('mf3'!$B$27:$G$51,MATCH('mf2'!B50,'mf3'!$B$27:$B$51,0),6)","v":{"$error":"#N/A"}},{"$f":"IF(ISERROR(INDEX('mf3'!$B$27:$B$51,MATCH('mf2'!B50,'mf3'!$B$27:$B$51,0),1)),0,1)","v":0},{"$f":"INDEX('mf2'!$B$27:$B$51,MATCH('mf3'!B50,'mf2'!$B$27:$B$51,0),1)","v":{"$error":"#N/A"}},{"$f":"INDEX('mf2'!$B$27:$G$51,MATCH('mf3'!B50,'mf2'!$B$27:$B$51,0),6)","v":{"$error":"#N/A"}},"ACC",null,{"$f":"INDEX('mf3'!$B$27:$B$51,MATCH('mf1'!B50,'mf3'!$B$27:$B$51,0),1)","v":{"$error":"#N/A"}},{"$f":"INDEX('mf3'!$B$27:$G$51,MATCH('mf1'!B50,'mf3'!$B$27:$B$51,0),6)","v":{"$error":"#N/A"}},{"$f":"IF(ISERROR(INDEX('mf3'!$B$27:$B$51,MATCH('mf1'!B50,'mf3'!$B$27:$B$51,0),1)),0,1)","v":0},{"$f":"INDEX('mf1'!$B$27:$B$51,MATCH('mf3'!B50,'mf1'!$B$27:$B$51,0),1)","v":{"$error":"#N/A"}},{"$f":"INDEX('mf1'!$B$27:$G$51,MATCH('mf3'!B50,'mf1'!$B$27:$B$51,0),6)","v":{"$error":"#N/A"}},0]
[null,null,null,null,null,null,null,null,25,{"$f":"INDEX('mf2'!$B$27:$B$51,MATCH('mf1'!B51,'mf2'!$B$27:$B$51,0),1)","v":{"$error":"#N/A"}},{"$f":"INDEX('mf2'!$B$27:$G$51,MATCH('mf1'!B51,'mf2'!$B$27:$B$51,0),6)","v":{"$error":"#N/A"}},{"$f":"IF(ISERROR(INDEX('mf2'!$B$27:$B$51,MATCH('mf1'!B51,'mf2'!$B$27:$B$51,0),1)),0,1)","v":0},{"$f":"INDEX('mf1'!$B$27:$B$51,MATCH('mf2'!B51,'mf1'!$B$27:$B$51,0),1)","v":{"$error":"#N/A"}},{"$f":"INDEX('mf1'!$B$27:$G$51,MATCH('mf2'!B51,'mf1'!$B$27:$B$51,0),6)","v":{"$error":"#N/A"}},0,null,{"$f":"INDEX('mf3'!$B$27:$B$51,MATCH('mf2'!B51,'mf3'!$B$27:$B$51,0),1)","v":"ACC"},{"$f":"INDEX('mf3'!$B$27:$G$51,MATCH('mf2'!B51,'mf3'!$B$27:$B$51,0),6)","v":3.63},{"$f":"IF(ISERROR(INDEX('mf3'!$B$27:$B$51,MATCH('mf2'!B51,'mf3'!$B$27:$B$51,0),1)),0,1)","v":1},{"$f":"INDEX('mf2'!$B$27:$B$51,MATCH('mf3'!B51,'mf2'!$B$27:$B$51,0),1)","v":{"$error":"#N/A"}},{"$f":"INDEX('mf2'!$B$27:$G$51,MATCH('mf3'!B51,'mf2'!$B$27:$B$51,0),6)","v":{"$error":"#N/A"}},"ACC",null,{"$f":"INDEX('mf3'!$B$27:$B$51,MATCH('mf1'!B51,'mf3'!$B$27:$B$51,0),1)","v":{"$error":"#N/A"}},{"$f":"INDEX('mf3'!$B$27:$G$51,MATCH('mf1'!B51,'mf3'!$B$27:$B$51,0),6)","v":{"$error":"#N/A"}},{"$f":"IF(ISERROR(INDEX('mf3'!$B$27:$B$51,MATCH('mf1'!B51,'mf3'!$B$27:$B$51,0),1)),0,1)","v":0},{"$f":"INDEX('mf1'!$B$27:$B$51,MATCH('mf3'!B51,'mf1'!$B$27:$B$51,0),1)","v":{"$error":"#N/A"}},{"$f":"INDEX('mf1'!$B$27:$G$51,MATCH('mf3'!B51,'mf1'!$B$27:$B$51,0),6)","v":{"$error":"#N/A"}},0]
["Sector-wise allocation (data is given below the chart)"]
[]
[]
[]
[]
[]
[]
[]
[]
[]
[]
[]
[]
[]
[]
[]
[]
[]
["Sector",{"$f":"B2","v":"IDFC Premier Equity Direct"},{"$f":"C2","v":"Franklin India Bluechip"},{"$f":"D2","v":"Quantum Long Term Equity"}]
["Automobile",{"$f":"SUMIF('mf1'!$C$27:$G$146,A46,'mf1'!$G$27:$G$146)","v":5.38},{"$f":"SUMIF('mf2'!$C$27:$G$146,A46,'mf2'!$G$27:$G$146)","v":1.61},{"$f":"SUMIF('mf3'!$C$27:$G$146,A46,'mf3'!$G$27:$G$146)","v":12.59}]
["Chemicals",{"$f":"SUMIF('mf1'!$C$27:$G$146,A47,'mf1'!$G$27:$G$146)","v":5.6},{"$f":"SUMIF('mf2'!$C$27:$G$146,A47,'mf2'!$G$27:$G$146)","v":1.52},{"$f":"SUMIF('mf3'!$C$27:$G$146,A47,'mf3'!$G$27:$G$146)","v":3.25}]
["Communication",{"$f":"SUMIF('mf1'!$C$27:$G$146,A48,'mf1'!$G$27:$G$146)","v":0},{"$f":"SUMIF('mf2'!$C$27:$G$146,A48,'mf2'!$G$27:$G$146)","v":8.1300000000000008},{"$f":"SUMIF('mf3'!$C$27:$G$146,A48,'mf3'!$G$27:$G$146)","v":0}]
["Construction",{"$f":"SUMIF('mf1'!$C$27:$G$146,A49,'mf1'!$G$27:$G$146)","v":0},{"$f":"SUMIF('mf2'!$C$27:$G$146,A49,'mf2'!$G$27:$G$146)","v":1.46},{"$f":"SUMIF('mf3'!$C$27:$G$146,A49,'mf3'!$G$27:$G$146)","v":3.63}]
["Diversified",{"$f":"SUMIF('mf1'!$C$27:$G$146,A50,'mf1'!$G$27:$G$146)","v":0},{"$f":"SUMIF('mf2'!$C$27:$G$146,A50,'mf2'!$G$27:$G$146)","v":5.4399999999999995},{"$f":"SUMIF('mf3'!$C$27:$G$146,A50,'mf3'!$G$27:$G$146)","v":2.31}]
["Energy",{"$f":"SUMIF('mf1'!$C$27:$G$146,A51,'mf1'!$G$27:$G$146)","v":6.58},{"$f":"SUMIF('mf2'!$C$27:$G$146,A51,'mf2'!$G$27:$G$146)","v":16.749999999999996},{"$f":"SUMIF('mf3'!$C$27:$G$146,A51,'mf3'!$G$27:$G$146)","v":16.029999999999998}]
["Engineering",{"$f":"SUMIF('mf1'!$C$27:$G$146,A52,'mf1'!$G$27:$G$146)","v":5.35},{"$f":"SUMIF('mf2'!$C$27:$G$146,A52,'mf2'!$G$27:$G$146)","v":0},{"$f":"SUMIF('mf3'!$C$27:$G$146,A52,'mf3'!$G$27:$G$146)","v":7.1300000000000008}]
["Financial",{"$f":"SUMIF('mf1'!$C$27:$G$146,A53,'mf1'!$G$27:$G$146)","v":3.83},{"$f":"SUMIF('mf2'!$C$27:$G$146,A53,'mf2'!$G$27:$G$146)","v":21.990000000000002},{"$f":"SUMIF('mf3'!$C$27:$G$146,A53,'mf3'!$G$27:$G$146)","v":13.39}]
["FMCG",{"$f":"SUMIF('mf1'!$C$27:$G$146,A54,'mf1'!$G$27:$G$146)","v":14.780000000000001},{"$f":"SUMIF('mf2'!$C$27:$G$146,A54,'mf2'!$G$27:$G$146)","v":0},{"$f":"SUMIF('mf3'!$C$27:$G$146,A54,'mf3'!$G$27:$G$146)","v":0}]
["Healthcare",{"$f":"SUMIF('mf1'!$C$27:$G$146,A55,'mf1'!$G$27:$G$146)","v":0},{"$f":"SUMIF('mf2'!$C$27:$G$146,A55,'mf2'!$G$27:$G$146)","v":9.58},{"$f":"SUMIF('mf3'!$C$27:$G$146,A55,'mf3'!$G$27:$G$146)","v":0}]
["Metals",{"$f":"SUMIF('mf1'!$C$27:$G$146,A56,'mf1'!$G$27:$G$146)","v":0},{"$f":"SUMIF('mf2'!$C$27:$G$146,A56,'mf2'!$G$27:$G$146)","v":0},{"$f":"SUMIF('mf3'!$C$27:$G$146,A56,'mf3'!$G$27:$G$146)","v":2.12}]
["Services",{"$f":"SUMIF('mf1'!$C$27:$G$146,A57,'mf1'!$G$27:$G$146)","v":18.759999999999998},{"$f":"SUMIF('mf2'!$C$27:$G$146,A57,'mf2'!$G$27:$G$146)","v":0},{"$f":"SUMIF('mf3'!$C$27:$G$146,A57,'mf3'!$G$27:$G$146)","v":8}]
["Technology",{"$f":"SUMIF('mf1'!$C$27:$G$146,A58,'mf1'!$G$27:$G$146)","v":1.52},{"$f":"SUMIF('mf2'!$C$27:$G$146,A58,'mf2'!$G$27:$G$146)","v":13.129999999999999},{"$f":"SUMIF('mf3'!$C$27:$G$146,A58,'mf3'!$G$27:$G$146)","v":8.52}]
["Others",{"$f":"SUMIF('mf1'!$C$27:$G$146,A59,'mf1'!$G$27:$G$146)","v":0},{"$f":"SUMIF('mf2'!$C$27:$G$146,A59,'mf2'!$G$27:$G$146)","v":3.59},{"$f":"SUMIF('mf3'!$C$27:$G$146,A59,'mf3'!$G$27:$G$146)","v":0}]
["Textiles",{"$f":"SUMIF('mf1'!$C$27:$G$146,A60,'mf1'!$G$27:$G$146)","v":6.9},{"$f":"SUMIF('mf2'!$C$27:$G$146,A60,'mf2'!$G$27:$G$146)","v":0},{"$f":"SUMIF('mf3'!$C$27:$G$146,A60,'mf3'!$G$27:$G$146)","v":0}]
["Cons Durable",{"$f":"SUMIF('mf1'!$C$27:$G$146,A61,'mf1'!$G$27:$G$146)","v":0},{"$f":"SUMIF('mf2'!$C$27:$G$146,A61,'mf2'!$G$27:$G$146)","v":0},{"$f":"SUMIF('mf3'!$C$27:$G$146,A61,'mf3'!$G$27:$G$146)","v":3.63}]

{"sheet":"Results-advanced","index":2,"n_rows":55,"n_cols":13,"rows_kept":55,"cut":false,"hidden":false,"merged":[[28,4,28,6]]}
["Common Stocks (% in equity folio)",{"$f":"'Results-simple'!C2","v":"Franklin India Bluechip"},{"$f":"'Results-simple'!B2","v":"IDFC Premier Equity Direct"},null,"Common Stocks (% in equity folio)",{"$f":"'Results-simple'!D2","v":"Quantum Long Term Equity"},{"$f":"'Results-simple'!C2","v":"Franklin India Bluechip"},null,null,null,null,{"$f":"IF(M1=\"\",IF(M2=\"\",IF(M3=\"\",IF(M4=\"\",IF(M5=\"\",IF(M6=\"\",IF(M7=\"\",IF(M8=\"\",IF(M9=\"\",IF(M10=\"\",IF(M11=\"\",IF(M12=\"\",IF(M13=\"\",IF(M14=\"\",IF(M15=\"\",IF(M16=\"\",IF(M17=\"\",IF(M18=\"\",IF(M19=\"\",IF(M20=\"\",IF(M21=\"\",IF(M22=\"\",IF(M23=\"\",IF(M24=\"\",IF(M25=\"\",IF(M26=\"\",M27,M26),M25),M24),M23),M22),M21),M20),M19),M18),M17),M16),M15),M14),M13),M12),M11),M10),M9),M8),M7),M6),M5),M4),M3),M2),M1)","v":0},{"$f":"IF(ISERROR(INDEX($E$2:$E$26,MATCH(A2,$E$2:$E$26,0),1)),\"\",INDEX($E$2:$E$26,MATCH(A2,$E$2:$E$26,0),1))","v":""}]
[{"$f":"INDEX(mutualfund2s,MATCH(0,COUNTIF($A$1:A1,mutualfund2s),0))","v":"Asian Paints"},{"$f":"  IF(ISERROR(A2),\"\",IF(A2=0,\"\",INDEX(mf2port,MATCH(A2,\\,0),2)))","v":1.52},{"$f":"  IF(ISERROR(A2),\"\",IF(A2=0,\"\",INDEX(mf1port,MATCH(A2,'Results-simple'!$M$2:$M$26,0),2)))","v":3.27},null,{"$f":"INDEX(mutualfund3s,MATCH(0,COUNTIF($E$1:E1,mutualfund3s),0))","v":"Infosys"},{"$f":"  IF(ISERROR(E2),\"\",IF(E2=0,\"\",INDEX(mf3port,MATCH(E2,mf3stocks,0),2)))","v":5.05},{"$f":"IF(ISERROR(E2),\"\",IF(E2=0,\"\",INDEX(mf2port2,MATCH(E2,'Results-simple'!$T$2:$T$26,0),2)))","v":9.7899999999999991},null,null,null,{"$f":"INDEX(common3,MATCH(0,COUNTIF($K$1:K1,common3),0))","v":0},{"$f":"IF(M2=\"\",IF(M3=\"\",IF(M4=\"\",IF(M5=\"\",IF(M6=\"\",IF(M7=\"\",IF(M8=\"\",IF(M9=\"\",IF(M10=\"\",IF(M11=\"\",IF(M12=\"\",IF(M13=\"\",IF(M14=\"\",IF(M15=\"\",IF(M16=\"\",IF(M17=\"\",IF(M18=\"\",IF(M19=\"\",IF(M20=\"\",IF(M21=\"\",IF(M22=\"\",IF(M23=\"\",IF(M24=\"\",IF(M25=\"\",IF(M26=\"\",IF(M27=\"\",M28,M27),M26),M25),M24),M23),M22),M21),M20),M19),M18),M17),M16),M15),M14),M13),M12),M11),M10),M9),M8),M7),M6),M5),M4),M3),M2)","v":0},""]
[{"$f":"INDEX(mutualfund2s,MATCH(0,COUNTIF($A$1:A2,mutualfund2s),0))","v":"HDFC Bank"},5.68,{"$f":"  IF(ISERROR(A3),\"\",IF(A3=0,\"\",INDEX(mf1port,MATCH(A3,'Results-simple'!$M$2:$M$26,0),2)))","v":1.93},null,{"$f":"INDEX(mutualfund3s,MATCH(0,COUNTIF($E$1:E2,mutualfund3s),0))","v":"ONGC"},3.62,{"$f":"IF(ISERROR(E3),\"\",IF(E3=0,\"\",INDEX(mf2port2,MATCH(E3,'Results-simple'!$T$2:$T$26,0),2)))","v":2.88},null,null,null,{"$f":"INDEX(common3,MATCH(0,COUNTIF($K$1:K2,common3),0))","v":{"$error":"#N/A"}},0,""]
[{"$f":"INDEX(mutualfund2s,MATCH(0,COUNTIF($A$1:A3,mutualfund2s),0))","v":0},"",{"$f":"  IF(ISERROR(A4),\"\",IF(A4=0,\"\",INDEX(mf1port,MATCH(A4,'Results-simple'!$M$2:$M$26,0),2)))","v":""},null,{"$f":"INDEX(mutualfund3s,MATCH(0,COUNTIF($E$1:E3,mutualfund3s),0))","v":"NTPC"},2.29,{"$f":"IF(ISERROR(E4),\"\",IF(E4=0,\"\",INDEX(mf2port2,MATCH(E4,'Results-simple'!$T$2:$T$26,0),2)))","v":2.8},null,null,null,{"$f":"INDEX(common3,MATCH(0,COUNTIF($K$1:K3,common3),0))","v":{"$error":"#N/A"}},0,""]
[{"$f":"INDEX(mutualfund2s,MATCH(0,COUNTIF($A$1:A4,mutualfund2s),0))","v":{"$error":"#N/A"}},"",{"$f":"  IF(ISERROR(A5),\"\",IF(A5=0,\"\",INDEX(mf1port,MATCH(A5,'Results-simple'!$M$2:$M$26,0),2)))","v":""},null,{"$f":"INDEX(mutualfund3s,MATCH(0,COUNTIF($E$1:E4,mutualfund3s),0))","v":"Larsen & Toubro"},2.31,{"$f":"IF(ISERROR(E5),\"\",IF(E5=0,\"\",INDEX(mf2port2,MATCH(E5,'Results-simple'!$T$2:$T$26,0),2)))","v":2.12},null,null,null,{"$f":"INDEX(common3,MATCH(0,COUNTIF($K$1:K4,common3),0))","v":{"$error":"#N/A"}},0,""]
[{"$f":"INDEX(mutualfund2s,MATCH(0,COUNTIF($A$1:A5,mutualfund2s),0))","v":{"$error":"#N/A"}},"",{"$f":"  IF(ISERROR(A6),\"\",IF(A6=0,\"\",INDEX(mf1port,MATCH(A6,'Results-simple'!$M$2:$M$26,0),2)))","v":""},null,{"$f":"INDEX(mutualfund3s,MATCH(0,COUNTIF($E$1:E5,mutualfund3s),0))","v":"HDFC"},5.61,{"$f":"IF(ISERROR(E6),\"\",IF(E6=0,\"\",INDEX(mf2port2,MATCH(E6,'Results-simple'!$T$2:$T$26,0),2)))","v":2.09},null,null,null,{"$f":"INDEX(common3,MATCH(0,COUNTIF($K$1:K5,common3),0))","v":{"$error":"#N/A"}},0,""]
[{"$f":"INDEX(mutualfund2s,MATCH(0,COUNTIF($A$1:A6,mutualfund2s),0))","v":{"$error":"#N/A"}},"",{"$f":"  IF(ISERROR(A7),\"\",IF(A7=0,\"\",INDEX(mf1port,MATCH(A7,'Results-simple'!$M$2:$M$26,0),2)))","v":""},null,{"$f":"INDEX(mutualfund3s,MATCH(0,COUNTIF($E$1:E6,mutualfund3s),0))","v":"Hero Motocorp"},2.88,{"$f":"IF(ISERROR(E7),\"\",IF(E7=0,\"\",INDEX(mf2port2,MATCH(E7,'Results-simple'!$T$2:$T$26,0),2)))","v":1.61},null,null,null,{"$f":"INDEX(common3,MATCH(0,COUNTIF($K$1:K6,common3),0))","v":{"$error":"#N/A"}},0,""]
[{"$f":"INDEX(mutualfund2s,MATCH(0,COUNTIF($A$1:A7,mutualfund2s),0))","v":{"$error":"#N/A"}},"",{"$f":"  IF(ISERROR(A8),\"\",IF(A8=0,\"\",INDEX(mf1port,MATCH(A8,'Results-simple'!$M$2:$M$26,0),2)))","v":""},null,{"$f":"INDEX(mutualfund3s,MATCH(0,COUNTIF($E$1:E7,mutualfund3s),0))","v":"ACC"},3.63,{"$f":"IF(ISERROR(E8),\"\",IF(E8=0,\"\",INDEX(mf2port2,MATCH(E8,'Results-simple'!$T$2:$T$26,0),2)))","v":1.46},null,null,null,{"$f":"INDEX(common3,MATCH(0,COUNTIF($K$1:K7,common3),0))","v":{"$error":"#N/A"}},0,""]
[{"$f":"INDEX(mutualfund2s,MATCH(0,COUNTIF($A$1:A8,mutualfund2s),0))","v":{"$error":"#N/A"}},"",{"$f":"  IF(ISERROR(A9),\"\",IF(A9=0,\"\",INDEX(mf1port,MATCH(A9,'Results-simple'!$M$2:$M$26,0),2)))","v":""},null,{"$f":"INDEX(mutualfund3s,MATCH(0,COUNTIF($E$1:E8,mutualfund3s),0))","v":{"$error":"#N/A"}},"",{"$f":"IF(ISERROR(E9),\"\",IF(E9=0,\"\",INDEX(mf2port2,MATCH(E9,'Results-simple'!$T$2:$T$26,0),2)))","v":""},null,null,null,{"$f":"INDEX(common3,MATCH(0,COUNTIF($K$1:K8,common3),0))","v":{"$error":"#N/A"}},0,""]
[{"$f":"INDEX(mutualfund2s,MATCH(0,COUNTIF($A$1:A9,mutualfund2s),0))","v":{"$error":"#N/A"}},"",{"$f":"  IF(ISERROR(A10),\"\",IF(A10=0,\"\",INDEX(mf1port,MATCH(A10,'Results-simple'!$M$2:$M$26,0),2)))","v":""},null,{"$f":"INDEX(mutualfund3s,MATCH(0,COUNTIF($E$1:E9,mutualfund3s),0))","v":{"$error":"#N/A"}},"",{"$f":"IF(ISERROR(E10),\"\",IF(E10=0,\"\",INDEX(mf2port2,MATCH(E10,'Results-simple'!$T$2:$T$26,0),2)))","v":""},null,null,null,{"$f":"INDEX(common3,MATCH(0,COUNTIF($K$1:K9,common3),0))","v":{"$error":"#N/A"}},0,""]
[{"$f":"INDEX(mutualfund2s,MATCH(0,COUNTIF($A$1:A10,mutualfund2s),0))","v":{"$error":"#N/A"}},"",{"$f":"  IF(ISERROR(A11),\"\",IF(A11=0,\"\",INDEX(mf1port,MATCH(A11,'Results-simple'!$M$2:$M$26,0),2)))","v":""},null,{"$f":"INDEX(mutualfund3s,MATCH(0,COUNTIF($E$1:E10,mutualfund3s),0))","v":{"$error":"#N/A"}},"",{"$f":"IF(ISERROR(E11),\"\",IF(E11=0,\"\",INDEX(mf2port2,MATCH(E11,'Results-simple'!$T$2:$T$26,0),2)))","v":""},null,null,null,{"$f":"INDEX(common3,MATCH(0,COUNTIF($K$1:K10,common3),0))","v":{"$error":"#N/A"}},0,""]
[{"$f":"INDEX(mutualfund2s,MATCH(0,COUNTIF($A$1:A11,mutualfund2s),0))","v":{"$error":"#N/A"}},"",{"$f":"  IF(ISERROR(A12),\"\",IF(A12=0,\"\",INDEX(mf1port,MATCH(A12,'Results-simple'!$M$2:$M$26,0),2)))","v":""},null,{"$f":"INDEX(mutualfund3s,MATCH(0,COUNTIF($E$1:E11,mutualfund3s),0))","v":{"$error":"#N/A"}},"",{"$f":"IF(ISERROR(E12),\"\",IF(E12=0,\"\",INDEX(mf2port2,MATCH(E12,'Results-simple'!$T$2:$T$26,0),2)))","v":""},null,null,null,{"$f":"INDEX(common3,MATCH(0,COUNTIF($K$1:K11,common3),0))","v":{"$error":"#N/A"}},0,""]
[{"$f":"INDEX(mutualfund2s,MATCH(0,COUNTIF($A$1:A12,mutualfund2s),0))","v":{"$error":"#N/A"}},"",{"$f":"  IF(ISERROR(A13),\"\",IF(A13=0,\"\",INDEX(mf1port,MATCH(A13,'Results-simple'!$M$2:$M$26,0),2)))","v":""},null,{"$f":"INDEX(mutualfund3s,MATCH(0,COUNTIF($E$1:E12,mutualfund3s),0))","v":{"$error":"#N/A"}},"",{"$f":"IF(ISERROR(E13),\"\",IF(E13=0,\"\",INDEX(mf2port2,MATCH(E13,'Results-simple'!$T$2:$T$26,0),2)))","v":""},null,null,null,{"$f":"INDEX(common3,MATCH(0,COUNTIF($K$1:K12,common3),0))","v":{"$error":"#N/A"}},0,""]
[{"$f":"INDEX(mutualfund2s,MATCH(0,COUNTIF($A$1:A13,mutualfund2s),0))","v":{"$error":"#N/A"}},"",{"$f":"  IF(ISERROR(A14),\"\",IF(A14=0,\"\",INDEX(mf1port,MATCH(A14,'Results-simple'!$M$2:$M$26,0),2)))","v":""},null,{"$f":"INDEX(mutualfund3s,MATCH(0,COUNTIF($E$1:E13,mutualfund3s),0))","v":{"$error":"#N/A"}},"",{"$f":"IF(ISERROR(E14),\"\",IF(E14=0,\"\",INDEX(mf2port2,MATCH(E14,'Results-simple'!$T$2:$T$26,0),2)))","v":""},null,null,null,{"$f":"INDEX(common3,MATCH(0,COUNTIF($K$1:K13,common3),0))","v":{"$error":"#N/A"}},0,""]
[{"$f":"INDEX(mutualfund2s,MATCH(0,COUNTIF($A$1:A14,mutualfund2s),0))","v":{"$error":"#N/A"}},"",{"$f":"  IF(ISERROR(A15),\"\",IF(A15=0,\"\",INDEX(mf1port,MATCH(A15,'Results-simple'!$M$2:$M$26,0),2)))","v":""},null,{"$f":"INDEX(mutualfund3s,MATCH(0,COUNTIF($E$1:E14,mutualfund3s),0))","v":{"$error":"#N/A"}},"",{"$f":"IF(ISERROR(E15),\"\",IF(E15=0,\"\",INDEX(mf2port2,MATCH(E15,'Results-simple'!$T$2:$T$26,0),2)))","v":""},null,null,null,{"$f":"INDEX(common3,MATCH(0,COUNTIF($K$1:K14,common3),0))","v":{"$error":"#N/A"}},0,""]
[{"$f":"INDEX(mutualfund2s,MATCH(0,COUNTIF($A$1:A15,mutualfund2s),0))","v":{"$error":"#N/A"}},"",{"$f":"  IF(ISERROR(A16),\"\",IF(A16=0,\"\",INDEX(mf1port,MATCH(A16,'Results-simple'!$M$2:$M$26,0),2)))","v":""},null,{"$f":"INDEX(mutualfund3s,MATCH(0,COUNTIF($E$1:E15,mutualfund3s),0))","v":{"$error":"#N/A"}},"",{"$f":"IF(ISERROR(E16),\"\",IF(E16=0,\"\",INDEX(mf2port2,MATCH(E16,'Results-simple'!$T$2:$T$26,0),2)))","v":""},null,null,null,{"$f":"INDEX(common3,MATCH(0,COUNTIF($K$1:K15,common3),0))","v":{"$error":"#N/A"}},0,""]
[{"$f":"INDEX(mutualfund2s,MATCH(0,COUNTIF($A$1:A16,mutualfund2s),0))","v":{"$error":"#N/A"}},"",{"$f":"  IF(ISERROR(A17),\"\",IF(A17=0,\"\",INDEX(mf1port,MATCH(A17,'Results-simple'!$M$2:$M$26,0),2)))","v":""},null,{"$f":"INDEX(mutualfund3s,MATCH(0,COUNTIF($E$1:E16,mutualfund3s),0))","v":{"$error":"#N/A"}},"",{"$f":"IF(ISERROR(E17),\"\",IF(E17=0,\"\",INDEX(mf2port2,MATCH(E17,'Results-simple'!$T$2:$T$26,0),2)))","v":""},null,null,null,{"$f":"INDEX(common3,MATCH(0,COUNTIF($K$1:K16,common3),0))","v":{"$error":"#N/A"}},0,""]
[{"$f":"INDEX(mutualfund2s,MATCH(0,COUNTIF($A$1:A17,mutualfund2s),0))","v":{"$error":"#N/A"}},"",{"$f":"  IF(ISERROR(A18),\"\",IF(A18=0,\"\",INDEX(mf1port,MATCH(A18,'Results-simple'!$M$2:$M$26,0),2)))","v":""},null,{"$f":"INDEX(mutualfund3s,MATCH(0,COUNTIF($E$1:E17,mutualfund3s),0))","v":{"$error":"#N/A"}},"",{"$f":"IF(ISERROR(E18),\"\",IF(E18=0,\"\",INDEX(mf2port2,MATCH(E18,'Results-simple'!$T$2:$T$26,0),2)))","v":""},null,null,null,{"$f":"INDEX(common3,MATCH(0,COUNTIF($K$1:K17,common3),0))","v":{"$error":"#N/A"}},0,""]
[{"$f":"INDEX(mutualfund2s,MATCH(0,COUNTIF($A$1:A18,mutualfund2s),0))","v":{"$error":"#N/A"}},"",{"$f":"  IF(ISERROR(A19),\"\",IF(A19=0,\"\",INDEX(mf1port,MATCH(A19,'Results-simple'!$M$2:$M$26,0),2)))","v":""},null,{"$f":"INDEX(mutualfund3s,MATCH(0,COUNTIF($E$1:E18,mutualfund3s),0))","v":{"$error":"#N/A"}},"",{"$f":"IF(ISERROR(E19),\"\",IF(E19=0,\"\",INDEX(mf2port2,MATCH(E19,'Results-simple'!$T$2:$T$26,0),2)))","v":""},null,null,null,{"$f":"INDEX(common3,MATCH(0,COUNTIF($K$1:K18,common3),0))","v":{"$error":"#N/A"}},0,""]
[{"$f":"INDEX(mutualfund2s,MATCH(0,COUNTIF($A$1:A19,mutualfund2s),0))","v":{"$error":"#N/A"}},"",{"$f":"  IF(ISERROR(A20),\"\",IF(A20=0,\"\",INDEX(mf1port,MATCH(A20,'Results-simple'!$M$2:$M$26,0),2)))","v":""},null,{"$f":"INDEX(mutualfund3s,MATCH(0,COUNTIF($E$1:E19,mutualfund3s),0))","v":{"$error":"#N/A"}},"",{"$f":"IF(ISERROR(E20),\"\",IF(E20=0,\"\",INDEX(mf2port2,MATCH(E20,'Results-simple'!$T$2:$T$26,0),2)))","v":""},null,null,null,{"$f":"INDEX(common3,MATCH(0,COUNTIF($K$1:K19,common3),0))","v":{"$error":"#N/A"}},0,""]
[{"$f":"INDEX(mutualfund2s,MATCH(0,COUNTIF($A$1:A20,mutualfund2s),0))","v":{"$error":"#N/A"}},"",{"$f":"  IF(ISERROR(A21),\"\",IF(A21=0,\"\",INDEX(mf1port,MATCH(A21,'Results-simple'!$M$2:$M$26,0),2)))","v":""},null,{"$f":"INDEX(mutualfund3s,MATCH(0,COUNTIF($E$1:E20,mutualfund3s),0))","v":{"$error":"#N/A"}},"",{"$f":"IF(ISERROR(E21),\"\",IF(E21=0,\"\",INDEX(mf2port2,MATCH(E21,'Results-simple'!$T$2:$T$26,0),2)))","v":""},null,null,null,{"$f":"INDEX(common3,MATCH(0,COUNTIF($K$1:K20,common3),0))","v":{"$error":"#N/A"}},0,""]
[{"$f":"INDEX(mutualfund2s,MATCH(0,COUNTIF($A$1:A21,mutualfund2s),0))","v":{"$error":"#N/A"}},"",{"$f":"  IF(ISERROR(A22),\"\",IF(A22=0,\"\",INDEX(mf1port,MATCH(A22,'Results-simple'!$M$2:$M$26,0),2)))","v":""},null,{"$f":"INDEX(mutualfund3s,MATCH(0,COUNTIF($E$1:E21,mutualfund3s),0))","v":{"$error":"#N/A"}},"",{"$f":"IF(ISERROR(E22),\"\",IF(E22=0,\"\",INDEX(mf2port2,MATCH(E22,'Results-simple'!$T$2:$T$26,0),2)))","v":""},null,null,null,{"$f":"INDEX(common3,MATCH(0,COUNTIF($K$1:K21,common3),0))","v":{"$error":"#N/A"}},0,""]
[{"$f":"INDEX(mutualfund2s,MATCH(0,COUNTIF($A$1:A22,mutualfund2s),0))","v":{"$error":"#N/A"}},"",{"$f":"  IF(ISERROR(A23),\"\",IF(A23=0,\"\",INDEX(mf1port,MATCH(A23,'Results-simple'!$M$2:$M$26,0),2)))","v":""},null,{"$f":"INDEX(mutualfund3s,MATCH(0,COUNTIF($E$1:E22,mutualfund3s),0))","v":{"$error":"#N/A"}},"",{"$f":"IF(ISERROR(E23),\"\",IF(E23=0,\"\",INDEX(mf2port2,MATCH(E23,'Results-simple'!$T$2:$T$26,0),2)))","v":""},null,null,null,{"$f":"INDEX(common3,MATCH(0,COUNTIF($K$1:K22,common3),0))","v":{"$error":"#N/A"}},0,""]
[{"$f":"INDEX(mutualfund2s,MATCH(0,COUNTIF($A$1:A23,mutualfund2s),0))","v":{"$error":"#N/A"}},"",{"$f":"  IF(ISERROR(A24),\"\",IF(A24=0,\"\",INDEX(mf1port,MATCH(A24,'Results-simple'!$M$2:$M$26,0),2)))","v":""},null,{"$f":"INDEX(mutualfund3s,MATCH(0,COUNTIF($E$1:E23,mutualfund3s),0))","v":{"$error":"#N/A"}},"",{"$f":"IF(ISERROR(E24),\"\",IF(E24=0,\"\",INDEX(mf2port2,MATCH(E24,'Results-simple'!$T$2:$T$26,0),2)))","v":""},null,null,null,{"$f":"INDEX(common3,MATCH(0,COUNTIF($K$1:K23,common3),0))","v":{"$error":"#N/A"}},0,""]
[{"$f":"INDEX(mutualfund2s,MATCH(0,COUNTIF($A$1:A24,mutualfund2s),0))","v":{"$error":"#N/A"}},"",{"$f":"  IF(ISERROR(A25),\"\",IF(A25=0,\"\",INDEX(mf1port,MATCH(A25,'Results-simple'!$M$2:$M$26,0),2)))","v":""},null,{"$f":"INDEX(mutualfund3s,MATCH(0,COUNTIF($E$1:E24,mutualfund3s),0))","v":{"$error":"#N/A"}},"",{"$f":"IF(ISERROR(E25),\"\",IF(E25=0,\"\",INDEX(mf2port2,MATCH(E25,'Results-simple'!$T$2:$T$26,0),2)))","v":""},null,null,null,{"$f":"INDEX(common3,MATCH(0,COUNTIF($K$1:K24,common3),0))","v":{"$error":"#N/A"}},0,""]
[{"$f":"INDEX(mutualfund2s,MATCH(0,COUNTIF($A$1:A25,mutualfund2s),0))","v":{"$error":"#N/A"}},"",{"$f":"  IF(ISERROR(A26),\"\",IF(A26=0,\"\",INDEX(mf1port,MATCH(A26,'Results-simple'!$M$2:$M$26,0),2)))","v":""},null,{"$f":"INDEX(mutualfund3s,MATCH(0,COUNTIF($E$1:E25,mutualfund3s),0))","v":{"$error":"#N/A"}},"",{"$f":"IF(ISERROR(E26),\"\",IF(E26=0,\"\",INDEX(mf2port2,MATCH(E26,'Results-simple'!$T$2:$T$26,0),2)))","v":""},null,null,null,{"$f":"INDEX(common3,MATCH(0,COUNTIF($K$1:K25,common3),0))","v":{"$error":"#N/A"}},0]
[null,null,null,null,null,null,null,null,null,null,{"$f":"INDEX(common3,MATCH(0,COUNTIF($K$1:K26,common3),0))","v":{"$error":"#N/A"}}]
[]
["Common Stocks (% in equity folio)",{"$f":"'Results-simple'!D2","v":"Quantum Long Term Equity"},{"$f":"'Results-simple'!B2","v":"IDFC Premier Equity Direct"},null,"Stocks common to all three funds (if applicable)"]
[{"$f":"INDEX(mutualfund4s,MATCH(0,COUNTIF($A$29:A29,mutualfund4s),0))","v":"GAIL"},{"$f":"IF(ISERROR(A30),\"\",IF(A30=0,\"\",INDEX(mf4port,MATCH(A30,mf4stocks,0),2)))","v":2.86},{"$f":"IF(ISERROR(A30),\"\",IF(A30=0,\"\",INDEX(mf4port4,MATCH(A30,'Results-simple'!$AA$2:$AA$26,0),2)))","v":3},null,null,{"$f":"IF(ISERROR(K2),\"\",IF(K2=0,\"\",K2))","v":""}]
[{"$f":"INDEX(mutualfund4s,MATCH(0,COUNTIF($A$29:A30,mutualfund4s),0))","v":"Container Corp."},4.1399999999999997,{"$f":"IF(ISERROR(A31),\"\",IF(A31=0,\"\",INDEX(mf4port4,MATCH(A31,'Results-simple'!$AA$2:$AA$26,0),2)))","v":2.84},null,null,{"$f":"IF(ISERROR(K3),\"\",IF(K3=0,\"\",K3))","v":""}]
[{"$f":"INDEX(mutualfund4s,MATCH(0,COUNTIF($A$29:A31,mutualfund4s),0))","v":"PTC India"},2.14,{"$f":"IF(ISERROR(A32),\"\",IF(A32=0,\"\",INDEX(mf4port4,MATCH(A32,'Results-simple'!$AA$2:$AA$26,0),2)))","v":1.85},null,null,""]
[{"$f":"INDEX(mutualfund4s,MATCH(0,COUNTIF($A$29:A32,mutualfund4s),0))","v":0},"",{"$f":"IF(ISERROR(A33),\"\",IF(A33=0,\"\",INDEX(mf4port4,MATCH(A33,'Results-simple'!$AA$2:$AA$26,0),2)))","v":""},null,null,""]
[{"$f":"INDEX(mutualfund4s,MATCH(0,COUNTIF($A$29:A33,mutualfund4s),0))","v":{"$error":"#N/A"}},"",{"$f":"IF(ISERROR(A34),\"\",IF(A34=0,\"\",INDEX(mf4port4,MATCH(A34,'Results-simple'!$AA$2:$AA$26,0),2)))","v":""},null,null,""]
[{"$f":"INDEX(mutualfund4s,MATCH(0,COUNTIF($A$29:A34,mutualfund4s),0))","v":{"$error":"#N/A"}},"",{"$f":"IF(ISERROR(A35),\"\",IF(A35=0,\"\",INDEX(mf4port4,MATCH(A35,'Results-simple'!$AA$2:$AA$26,0),2)))","v":""},null,null,""]
[{"$f":"INDEX(mutualfund4s,MATCH(0,COUNTIF($A$29:A35,mutualfund4s),0))","v":{"$error":"#N/A"}},"",{"$f":"IF(ISERROR(A36),\"\",IF(A36=0,\"\",INDEX(mf4port4,MATCH(A36,'Results-simple'!$AA$2:$AA$26,0),2)))","v":""},null,null,""]
[{"$f":"INDEX(mutualfund4s,MATCH(0,COUNTIF($A$29:A36,mutualfund4s),0))","v":{"$error":"#N/A"}},"",{"$f":"IF(ISERROR(A37),\"\",IF(A37=0,\"\",INDEX(mf4port4,MATCH(A37,'Results-simple'!$AA$2:$AA$26,0),2)))","v":""},null,null,""]
[{"$f":"INDEX(mutualfund4s,MATCH(0,COUNTIF($A$29:A37,mutualfund4s),0))","v":{"$error":"#N/A"}},"",{"$f":"IF(ISERROR(A38),\"\",IF(A38=0,\"\",INDEX(mf4port4,MATCH(A38,'Results-simple'!$AA$2:$AA$26,0),2)))","v":""},null,null,""]
[{"$f":"INDEX(mutualfund4s,MATCH(0,COUNTIF($A$29:A38,mutualfund4s),0))","v":{"$error":"#N/A"}},"",{"$f":"IF(ISERROR(A39),\"\",IF(A39=0,\"\",INDEX(mf4port4,MATCH(A39,'Results-simple'!$AA$2:$AA$26,0),2)))","v":""},null,null,""]
[{"$f":"INDEX(mutualfund4s,MATCH(0,COUNTIF($A$29:A39,mutualfund4s),0))","v":{"$error":"#N/A"}},"",{"$f":"IF(ISERROR(A40),\"\",IF(A40=0,\"\",INDEX(mf4port4,MATCH(A40,'Results-simple'!$AA$2:$AA$26,0),2)))","v":""},null,null,""]
[{"$f":"INDEX(mutualfund4s,MATCH(0,COUNTIF($A$29:A40,mutualfund4s),0))","v":{"$error":"#N/A"}},"",{"$f":"IF(ISERROR(A41),\"\",IF(A41=0,\"\",INDEX(mf4port4,MATCH(A41,'Results-simple'!$AA$2:$AA$26,0),2)))","v":""},null,null,""]
[{"$f":"INDEX(mutualfund4s,MATCH(0,COUNTIF($A$29:A41,mutualfund4s),0))","v":{"$error":"#N/A"}},"",{"$f":"IF(ISERROR(A42),\"\",IF(A42=0,\"\",INDEX(mf4port4,MATCH(A42,'Results-simple'!$AA$2:$AA$26,0),2)))","v":""},null,null,""]
[{"$f":"INDEX(mutualfund4s,MATCH(0,COUNTIF($A$29:A42,mutualfund4s),0))","v":{"$error":"#N/A"}},"",{"$f":"IF(ISERROR(A43),\"\",IF(A43=0,\"\",INDEX(mf4port4,MATCH(A43,'Results-simple'!$AA$2:$AA$26,0),2)))","v":""},null,null,""]
[{"$f":"INDEX(mutualfund4s,MATCH(0,COUNTIF($A$29:A43,mutualfund4s),0))","v":{"$error":"#N/A"}},"",{"$f":"IF(ISERROR(A44),\"\",IF(A44=0,\"\",INDEX(mf4port4,MATCH(A44,'Results-simple'!$AA$2:$AA$26,0),2)))","v":""},null,null,""]
[{"$f":"INDEX(mutualfund4s,MATCH(0,COUNTIF($A$29:A44,mutualfund4s),0))","v":{"$error":"#N/A"}},"",{"$f":"IF(ISERROR(A45),\"\",IF(A45=0,\"\",INDEX(mf4port4,MATCH(A45,'Results-simple'!$AA$2:$AA$26,0),2)))","v":""},null,null,""]
[{"$f":"INDEX(mutualfund4s,MATCH(0,COUNTIF($A$29:A45,mutualfund4s),0))","v":{"$error":"#N/A"}},"",{"$f":"IF(ISERROR(A46),\"\",IF(A46=0,\"\",INDEX(mf4port4,MATCH(A46,'Results-simple'!$AA$2:$AA$26,0),2)))","v":""},null,null,""]
[{"$f":"INDEX(mutualfund4s,MATCH(0,COUNTIF($A$29:A46,mutualfund4s),0))","v":{"$error":"#N/A"}},"",{"$f":"IF(ISERROR(A47),\"\",IF(A47=0,\"\",INDEX(mf4port4,MATCH(A47,'Results-simple'!$AA$2:$AA$26,0),2)))","v":""},null,null,""]
[{"$f":"INDEX(mutualfund4s,MATCH(0,COUNTIF($A$29:A47,mutualfund4s),0))","v":{"$error":"#N/A"}},"",{"$f":"IF(ISERROR(A48),\"\",IF(A48=0,\"\",INDEX(mf4port4,MATCH(A48,'Results-simple'!$AA$2:$AA$26,0),2)))","v":""},null,null,""]
[{"$f":"INDEX(mutualfund4s,MATCH(0,COUNTIF($A$29:A48,mutualfund4s),0))","v":{"$error":"#N/A"}},"",{"$f":"IF(ISERROR(A49),\"\",IF(A49=0,\"\",INDEX(mf4port4,MATCH(A49,'Results-simple'!$AA$2:$AA$26,0),2)))","v":""},null,null,""]
[{"$f":"INDEX(mutualfund4s,MATCH(0,COUNTIF($A$29:A49,mutualfund4s),0))","v":{"$error":"#N/A"}},"",{"$f":"IF(ISERROR(A50),\"\",IF(A50=0,\"\",INDEX(mf4port4,MATCH(A50,'Results-simple'!$AA$2:$AA$26,0),2)))","v":""},null,null,""]
[{"$f":"INDEX(mutualfund4s,MATCH(0,COUNTIF($A$29:A50,mutualfund4s),0))","v":{"$error":"#N/A"}},"",{"$f":"IF(ISERROR(A51),\"\",IF(A51=0,\"\",INDEX(mf4port4,MATCH(A51,'Results-simple'!$AA$2:$AA$26,0),2)))","v":""},null,null,""]
[{"$f":"INDEX(mutualfund4s,MATCH(0,COUNTIF($A$29:A51,mutualfund4s),0))","v":{"$error":"#N/A"}},"",{"$f":"IF(ISERROR(A52),\"\",IF(A52=0,\"\",INDEX(mf4port4,MATCH(A52,'Results-simple'!$AA$2:$AA$26,0),2)))","v":""},null,null,""]
[{"$f":"INDEX(mutualfund4s,MATCH(0,COUNTIF($A$29:A52,mutualfund4s),0))","v":{"$error":"#N/A"}},"",{"$f":"IF(ISERROR(A53),\"\",IF(A53=0,\"\",INDEX(mf4port4,MATCH(A53,'Results-simple'!$AA$2:$AA$26,0),2)))","v":""},null,null,""]
[{"$f":"INDEX(mutualfund4s,MATCH(0,COUNTIF($A$29:A53,mutualfund4s),0))","v":{"$error":"#N/A"}},"",{"$f":"IF(ISERROR(A54),\"\",IF(A54=0,\"\",INDEX(mf4port4,MATCH(A54,'Results-simple'!$AA$2:$AA$26,0),2)))","v":""},null,null,""]
[null,null,null,null,null,""]

{"sheet":"mf1","index":3,"n_rows":51,"n_cols":7,"rows_kept":51,"cut":false,"hidden":false,"merged":[]}
["IDFC Premier Equity Direct"]
[]
[]
["Category:","Equity: Mid & Small Cap"]
["Net Assets:","R 3,448 crore (As on Dec 31, 2013)"]
["Expense:","1.50% (As on Sep 30, 2013)"]
[]
["Concentration & Valuation"]
["Number of Stocks",53]
["Top 10 Stocks (%)",40.619999999999997]
["Top 5 Stocks (%)",25.94]
["Top 3 Sectors (%)",48.88]
["Portfolio P/B Ratio",5.75]
["Portfolio P/E Ratio",31]
[]
["Portfolio Aggregates"]
[null,"Fund","Benchmark","Category"]
["Average Mkt Cap (Rs Cr)",6836.5,112013.04,6666.85]
["Giant (%)",3.37,55.15,11.02]
["Large (%)",17.21,19.260000000000002,10.51]
["Mid (%)",53.02,18.63,53.08]
["Small (%)",26.1,5.95,30.93]
["Tiny (%)",0.3,0,1.5]
[]
["Top Holdings"]
[null,"Company","Sector","PE","3Y High","3Y Low","% Assets"]
[null,"Page Industries","Textiles",49.58,6.9,3.79,6.9]
[null,"Kaveri Seed Company","FMCG",18.18,6.28,0,6.28]
[null,"Blue Dart Express","Services",59.01,5.21,2.4900000000000002,4.62]
[null,"Bata India","FMCG",36.1,4.9000000000000004,3.28,4.29]
[null,"MRF","Automobile",10.76,3.85,0,3.85]
[null,"Asian Paints","Chemicals",39.869999999999997,5.43,3.27,3.27]
[null,"GAIL","Energy",12.1,3.17,0,3]
[null,"Zee Entertainment Ent.","Services",32.07,3.22,0,2.98]
[null,"Container Corp.","Services",17.13,3.13,0,2.84]
[null,"United Spirits","FMCG",106.41,5.82,0,2.59]
[null,"Gujarat State Petronet","Services",6.83,4.2,0,2.42]
[null,"Coromandel International","Chemicals",22.21,5.42,2.11,2.33]
[null,"Shopper's Stop","Services",70.430000000000007,2.2599999999999998,0,2.1]
[null,"Trent","Services",43.79,2.38,0,1.99]
[null,"HDFC Bank","Financial",20.14,2.96,0,1.93]
[null,"VA Tech Wabag","Engineering",20.47,1.92,0,1.92]
[null,"Shriram Transport Finance","Financial",10.61,5.77,1.82,1.9]
[null,"PTC India","Energy",8.5500000000000007,2.1800000000000002,0,1.85]
[null,"F A G Bearings India","Engineering",24.26,2.08,0,1.84]
[null,"Dish TV India","Services","-",1.88,0,1.81]
[null,"Torrent Power","Energy","-",3.21,1.43,1.73]
[null,"P&G Hygiene & Health Care","FMCG",42.95,1.65,0,1.62]
[null,"Siemens","Engineering",118.39,3.13,0,1.59]
[null,"Bosch","Automobile",32.75,1.73,0,1.53]
[null,"MindTree","Technology",15.49,1.52,0,1.52]

{"sheet":"mf2","index":4,"n_rows":51,"n_cols":7,"rows_kept":51,"cut":false,"hidden":false,"merged":[]}
["Franklin India Bluechip"]
[]
[]
["Category:","Equity: Large Cap"]
["Net Assets:","R 4,958 crore (As on Dec 31, 2013)"]
["Expense:","2.16% (As on Sep 30, 2013)"]
[]
["Concentration & Valuation"]
["Number of Stocks",41]
["Top 10 Stocks (%)",53.27]
["Top 5 Stocks (%)",35.06]
["Top 3 Sectors (%)",56.02]
["Portfolio P/B Ratio",3.42]
["Portfolio P/E Ratio",18.84]
[]
["Portfolio Aggregates"]
[null,"Fund","Benchmark","Category"]
["Average Mkt Cap (Rs Cr)",68139.100000000006,172465.42,95769.97]
["Giant (%)",57.19,88.53,71.03]
["Large (%)",29.19,10.76,20.25]
["Mid (%)",13.6,0.71,7.85]
["Small (%)","-","-",3.16]
["Tiny (%)","-","-",0.06]
[]
["Top Holdings"]
[null,"Company","Sector","PE","3Y High","3Y Low","% Assets"]
[null,"Infosys","Technology",22.91,9.7899999999999991,5.4,9.7899999999999991]
[null,"Bharti Airtel","Communication",20.309999999999999,9.1199999999999992,5.8,8.1300000000000008]
[null,"ICICI Bank","Financial",13.83,8.1,5.05,5.74]
[null,"Reliance Industries","Energy",12.11,5.97,3.76,5.72]
[null,"HDFC Bank","Financial",20.14,5.68,3.12,5.68]
[null,"Dr. Reddy's Lab","Healthcare",26.15,5.61,1.0900000000000001,5.61]
[null,"Cognizant Technology Solutions Corp.","Others","-","-","-",3.59]
[null,"Wipro","Technology",22.33,3.34,0,3.34]
[null,"Grasim Industries","Diversified",22.1,4.66,3.12,3.32]
[null,"Indusind Bank","Financial",16.760000000000002,3.35,0,3.05]
[null,"ONGC","Energy",12.84,3.46,1.5,2.88]
[null,"NTPC","Energy",7.85,3.31,1.35,2.8]
[null,"Cadila Healthcare","Healthcare",23.76,2.31,0.73,2.29]
[null,"Coal India","Energy",9.73,2.73,1.37,2.13]
[null,"Larsen & Toubro","Diversified",22.32,2.61,1.06,2.12]
[null,"HDFC","Financial",24.77,2.5,0,2.09]
[null,"Kotak Mahindra Bank","Financial",34.61,4.09,1.46,1.98]
[null,"Yes Bank","Financial",8.0500000000000007,2.1800000000000002,0,1.92]
[null,"Oil India","Energy",9.01,1.82,0,1.73]
[null,"Cipla","Healthcare",22.12,1.99,0,1.68]
[null,"Hero Motocorp","Automobile",18.87,1.61,0,1.61]
[null,"Federal Bank","Financial",8.83,1.85,0,1.53]
[null,"Asian Paints","Chemicals",39.869999999999997,2,0,1.52]
[null,"BPCL","Energy",6.05,1.49,0,1.49]
[null,"ACC","Construction",20.71,1.49,0,1.46]

{"sheet":"mf3","index":5,"n_rows":51,"n_cols":7,"rows_kept":51,"cut":false,"hidden":false,"merged":[]}
["Quantum Long Term Equity"]
[]
[]
["Category:","Equity: Large & Mid Cap"]
["Net Assets:","R 201 crore (As on Dec 31, 2013)"]
["Expense:","1.25% (As on Sep 30, 2013)"]
[]
["Concentration & Valuation"]
["Number of Stocks",27]
["Top 10 Stocks (%)",42.72]
["Top 5 Stocks (%)",24.51]
["Top 3 Sectors (%)",42.01]
["Portfolio P/B Ratio",2.93]
["Portfolio P/E Ratio",16.43]
[]
["Portfolio Aggregates"]
[null,"Fund","Benchmark","Category"]
["Average Mkt Cap (Rs Cr)",35661.22,172465.42,40279.06]
["Giant (%)",45.16,88.53,47.89]
["Large (%)",14.71,10.76,21.2]
["Mid (%)",36.869999999999997,0.71,24.23]
["Small (%)",3.26,"-",5.46]
["Tiny (%)","-","-","-"]
[]
["Top Holdings"]
[null,"Company","Sector","PE","3Y High","3Y Low","% Assets"]
[null,"HDFC","Financial",24.77,6.55,3.89,5.61]
[null,"Bajaj Auto","Automobile",17.45,7.39,4.2,5.41]
[null,"Infosys","Technology",22.91,7.19,3.17,5.05]
[null,"Maruti Suzuki India","Automobile",15.47,4.99,2.35,4.3]
[null,"Container Corp.","Services",17.13,5.01,3.59,4.1399999999999997]
[null,"Indian Hotels","Services","-",4.26,2.91,3.86]
[null,"ACC","Construction",20.71,3.73,0,3.63]
[null,"Voltas","Cons Durable",42.01,3.63,2.33,3.63]
[null,"ONGC","Energy",12.84,4.79,3.07,3.62]
[null,"Tata Consultancy Services","Technology",26.29,6.85,3.47,3.47]
[null,"Tata Chemicals","Chemicals",14.42,3.67,0,3.25]
[null,"Indian Oil Corp.","Energy",5.28,3.22,0,3.06]
[null,"Hero Motocorp","Automobile",18.87,3.97,0,2.88]
[null,"Crompton Greaves","Engineering",17.440000000000001,3.97,2.1800000000000002,2.87]
[null,"GAIL","Energy",12.1,3.14,0,2.86]
[null,"State Bank of India","Financial",10.55,3.9,2.79,2.79]
[null,"ING Vysya Bank","Financial",15.44,3.56,2.7,2.77]
[null,"Larsen & Toubro","Diversified",22.32,2.85,0,2.31]
[null,"NTPC","Energy",7.85,3.71,0,2.29]
[null,"Axis Bank","Financial",10.51,2.89,1.58,2.2200000000000002]
[null,"Cummins India","Engineering",21.75,3.38,0,2.16]
[null,"PTC India","Energy",8.5500000000000007,2.97,1.57,2.14]
[null,"Tata Steel","Metals",6.16,3.76,2.12,2.12]
[null,"Exide Inds.","Engineering",19.760000000000002,2.1,0,2.1]
[null,"Petronet LNG","Energy",12.03,2.5299999999999998,0,2.06]